{"text_format":"1","workbook":"xlsx","n_sheets":9,"sheets":["Control","Start","Guidance","NSEC-F","Attachment","Finance use only - ESFA","Finance use only- DFE,STA-TRA","System-Business Refrence","System-AccountCode"],"not_rendered":{"charts":0,"images":17,"macros":1,"external_links":1,"defined_names":15,"comments":0,"pivot_tables":0},"unopened":[],"bounds":{"document_bytes":16777216,"sheet_cells":100000,"rows_first":2000,"rows_last":500,"rows_between":2000,"halvings":0,"cell_chars":16384,"cell_head_chars":4096},"cells_cut":0,"cells_raw":0,"read":"whole","date_system":"1900"}

{"sheet":"Control","index":0,"n_rows":35,"n_cols":8,"rows_kept":35,"cut":false,"hidden":true,"merged":[]}
[null,null,null,null,null,null,"Tab:",{"$f":"MID(CELL(\"filename\",H1),FIND(\"]\",CELL(\"filename\",H1))+1,32)","v":"Control"}]
[]
[]
[]
[]
[null,"Non Staff Expenses Claim Form"]
[]
[null,"Purpose and overview of workbook"]
[]
[null,"The Purpose of this workbook is for Non-Staff to claim expense and then the information to be loaded on to BC for payments."]
{"$rows_left_out":26}
{"sheet":"Start","index":1,"n_rows":12,"n_cols":2,"rows_kept":12,"cut":false,"hidden":true,"merged":[[5,1,5,11],[10,1,10,11],[11,1,11,11]]}
[]
[]
[]
[null,"Non Staff Expenses Claim Form"]
[]
[null,"1. Open this document in Desktop Application."]
[]
[]
[]
[]
{"$rows_left_out":3}
{"sheet":"Guidance","index":2,"n_rows":49,"n_cols":6,"rows_kept":49,"cut":false,"hidden":false,"merged":[[5,2,5,6]]}
[]
[]
[]
[null,"Non-Staff Expense Claim Form"]
[null,1,"Before you complete this form, ensure your Vendor Account has been set up."]
[null,2,"This claim form should be used for non-taxable expenses, travel and other expenses that were necessary in pursuit of Departmental business.  It should not be used by appointed (fees paid) Committee Members for claiming fees or expenses."]
[null,3,"The form must be submitted within one month of incurring expenses and valid receipts must support all claims. Delays in submitting a valid claim may cause processing difficulties and can delay payment. "]
[null,4,"The completed form should be sent to the authoriser/departmental contact."]
[null,5,"Legible receipts must be provided for all claimed items (exception being mileage claims) and you will need to keep a copy of both the receipts and the form for 4 years."]
[null,6,"This form is for costs incurred by individuals and should not be used to reclaim costs which your organisation or school has incurred. Please contact your authoriser or departmental contact if unsure of what you can claim."]
{"$rows_left_out":40}
{"sheet":"NSEC-F","index":3,"n_rows":67,"n_cols":34,"rows_kept":67,"cut":false,"hidden":false,"merged":[[66,24,66,25],[66,26,66,32],[59,2,59,8],[64,1,65,25],[59,25,59,28],[61,19,61,24],[33,20,33,22],[31,20,31,22],[65,30,65,32],[50,9,50,11],[49,9,49,11],[50,12,50,18],[49,12,49,18],[51,9,51,11],[51,12,51,18],[52,9,52,11],[52,12,52,18],[53,9,53,11],[64,30,64,32],[53,12,53,18],[51,19,51,21],[51,22,51,24],[51,25,51,28],[58,19,58,21],[58,22,58,24],[58,25,58,28],[21,28,21,29],[21,30,21,32],[24,30,24,32],[39,29,39,32],[25,30,25,32],[26,30,26,32],[25,23,25,29],[23,23,23,24],[23,30,23,32],[18,28,18,29],[18,30,18,32],[21,25,21,27],[22,25,22,27],[22,28,22,29],[22,30,22,32],[22,23,22,24],[23,25,23,27],[23,28,23,29],[20,25,20,27],[20,28,20,29],[20,30,20,32],[19,25,19,27],[19,28,19,29],[19,30,19,32],[18,25,18,27],[15,28,15,29],[17,25,17,27],[17,28,17,29],[17,30,17,32],[17,15,17,17],[14,1,14,2],[14,3,14,10],[14,13,14,14],[17,18,17,20],[17,21,17,22],[14,15,14,17],[15,1,15,2],[15,3,15,10],[15,13,15,14],[15,15,15,17],[15,18,15,20],[15,21,15,22],[16,30,16,32],[15,23,15,24],[17,23,17,24],[15,30,15,32],[16,25,16,27],[16,28,16,29],[15,25,15,27],[13,30,13,32],[13,28,13,29],[14,25,14,27],[13,25,13,27],[14,28,14,29],[14,30,14,32],[14,23,14,24],[14,21,14,22],[14,18,14,20],[58,2,58,8],[54,19,54,21],[54,22,54,24],[52,22,52,24],[54,9,54,11],[54,12,54,18],[26,1,27,20],[21,3,21,10],[21,13,21,14],[21,15,21,17],[21,18,21,20],[50,2,50,8],[53,2,53,8],[54,2,54,8],[49,22,49,24],[50,19,50,21],[50,22,50,24],[58,9,58,11],[58,12,58,18],[56,19,56,21],[56,22,56,24],[53,19,53,21],[57,19,57,21],[57,22,57,24],[7,4,7,11],[9,4,9,11],[13,1,13,2],[13,3,13,10],[13,13,13,14],[13,15,13,17],[13,18,13,20],[13,21,13,22],[13,23,13,24],[57,2,57,8],[57,25,57,28],[19,21,19,22],[16,1,16,2],[16,3,16,10],[16,13,16,14],[16,15,16,17],[16,18,16,20],[16,21,16,22],[16,23,16,24],[53,25,53,28],[54,25,54,28],[26,27,26,29],[49,2,49,8],[47,8,47,10],[22,13,22,14],[45,5,45,10],[19,18,19,20],[21,23,21,24],[55,25,55,28],[52,19,52,21],[17,1,17,2],[17,3,17,10],[17,13,17,14],[61,25,61,28],[63,25,63,28],[22,1,22,2],[22,3,22,10],[59,19,59,21],[59,22,59,24],[59,9,59,11],[59,12,59,18],[53,22,53,24],[55,9,55,11],[55,12,55,18],[56,9,56,11],[22,15,22,17],[23,1,23,2],[23,3,23,10],[23,13,23,14],[23,15,23,17],[23,18,23,20],[23,21,23,22],[55,19,55,21],[55,22,55,24],[56,12,56,18],[57,9,57,11],[57,12,57,18],[22,18,22,20],[55,2,55,8],[51,2,51,8],[52,2,52,8],[22,21,22,22],[56,25,56,28],[24,25,24,29],[30,1,33,14],[56,2,56,8],[50,25,50,28],[52,25,52,28],[49,25,49,28],[49,19,49,21],[18,15,18,17],[18,18,18,20],[18,21,18,22],[18,23,18,24],[21,21,21,22],[20,1,20,2],[20,3,20,10],[20,13,20,14],[20,15,20,17],[20,18,20,20],[20,21,20,22],[20,23,20,24],[19,1,19,2],[19,3,19,10],[19,13,19,14],[19,15,19,17],[18,1,18,2],[18,3,18,10],[18,13,18,14],[21,1,21,2],[19,23,19,24]]}
[]
[]
[]
[null,"Non Staff Expenses Claim Form",null,null,null,null,null,null,null,null,null,null,null,null,null,null,null,null,null,null,null,null,null,null,null,null,null,null,null,null,null,null,null,"Department for Education"]
[null,null,null,"."]
[null,"Payee Details"]
[]
[null,"Name",null,null,"Peter Bryan"]
[]
[null,"Vendor Number",null,null,"P0109089"]
{"$rows_left_out":58}
{"sheet":"Attachment","index":4,"n_rows":14,"n_cols":4,"rows_kept":14,"cut":false,"hidden":false,"merged":[]}
[]
[]
[]
[]
[null,"Non Staff Expenses Claim Form"]
[null,null,"Receipts"]
[null,null,"To add a receipt, please: "]
[null,null,"1. Click the \"Add Reeipt\" button above and select the file to add."]
[null,null,"2. Update the description to reflect the line items on the form"]
[]
{"$rows_left_out":5}
{"sheet":"Finance use only - ESFA","index":5,"n_rows":18,"n_cols":29,"rows_kept":18,"cut":false,"hidden":true,"merged":[[2,4,2,5],[4,3,5,9]]}
[null,null,"Business use only -  ESFA"]
[null,null,1,"Complete Line No. from the expense form."]
[null,null,2,"Locate required template on the Finance Den, following the link: ","Click here for Manual Adjustments"]
[null,null,3,"Save a copy of the template on your desktop."]
[null,null,4,"Copy only the cells under the grey headers below onto the UPS template, as the yellow headers are pre-populated in the template / or press the copy button (which would copy the data from the form), Open up the Template, Click Paste special --> Tick Values --> Tick Skip Blanks --> Press Ok. "]
[]
[null,null,5,"Follow the 'How to complete a template guidance' on the Finance Den."]
["Company","Company Line No.","Line No","Document Type","Account Number","Provider name","Parent/Child","UKPRN","UPIN","Funding Type Code","Values excl. VAT","Posting Date","External Document Number","Project Code\nDimension 1","Ext. Ref. 1\nHolding Date","Ext. Ref. 5\nRemittance Comments","Payment Date","G/L Account Code","G/L Account Name","VAT Code"," Ext. Ref. 4","Cost Centre Code\nDimension 2","Contract No.\nDimension 3","Establishment Code","Expenditure type Code","Ext. Ref. 2\n","Ext. Ref. 3\n","Ext. Ref. 6\n","Remittance Description"]
["ESFA",{"$f":"A9&C9","v":"ESFA"},null,{"$f":"IFERROR(VLOOKUP(B9,'System-Business Refrence'!B2:K12,2,0),\"\")","v":""},{"$f":"IFERROR(VLOOKUP(B9,'System-Business Refrence'!$B$2:$K$12,3,0),\"\")","v":""},null,null,null,null,{"$f":"IFERROR(VLOOKUP(B9,'System-Business Refrence'!$B$2:$K$12,4,0),\"\")","v":""},{"$f":"IFERROR(VLOOKUP(B9,'System-Business Refrence'!$B$2:$K$12,9,0),\"\")","v":""},{"$f":"IFERROR(VLOOKUP(B9,'System-Business Refrence'!$B$2:$L$12,11,0),\"\")","v":""},null,null,null,{"$f":"IFERROR(VLOOKUP(B9,'System-Business Refrence'!$B$2:$L$12,10,0),\"\")","v":""},{"$f":"IFERROR(VLOOKUP(B9,'System-Business Refrence'!$B$2:$M$12,12,0),\"\")","v":""},{"$f":"IFERROR(VLOOKUP(B9,'System-Business Refrence'!$B$2:$L$12,5,0),\"\")","v":""},null,null,null,{"$f":"IFERROR(VLOOKUP(B9,'System-Business Refrence'!$B$2:$L$12,6,0),\"\")","v":""}]
["ESFA","ESFA",null,{"$f":"IFERROR(VLOOKUP(B10,'System-Business Refrence'!B3:K13,2,0),\"\")","v":""},{"$f":"IFERROR(VLOOKUP(B10,'System-Business Refrence'!$B$2:$K$12,3,0),\"\")","v":""},null,null,null,null,{"$f":"IFERROR(VLOOKUP(B10,'System-Business Refrence'!$B$2:$K$12,4,0),\"\")","v":""},{"$f":"IFERROR(VLOOKUP(B10,'System-Business Refrence'!$B$2:$K$12,9,0),\"\")","v":""},{"$f":"IFERROR(VLOOKUP(B10,'System-Business Refrence'!$B$2:$L$12,11,0),\"\")","v":""},null,null,null,{"$f":"IFERROR(VLOOKUP(B10,'System-Business Refrence'!$B$2:$L$12,10,0),\"\")","v":""},{"$f":"IFERROR(VLOOKUP(B10,'System-Business Refrence'!$B$2:$M$12,12,0),\"\")","v":""},{"$f":"IFERROR(VLOOKUP(B10,'System-Business Refrence'!$B$2:$L$12,5,0),\"\")","v":""},null,null,null,{"$f":"IFERROR(VLOOKUP(B10,'System-Business Refrence'!$B$2:$L$12,6,0),\"\")","v":""}]
{"$rows_left_out":9}
{"sheet":"Finance use only- DFE,STA-TRA","index":6,"n_rows":20,"n_cols":26,"rows_kept":20,"cut":false,"hidden":true,"merged":[[2,4,2,5],[4,3,5,9]]}
[null,null,"Business use only -  DFE Core, STA, TRA Template"]
[null,null,1,"Complete Line No. from the expense form."]
[null,null,2,"Locate required template on the Finance Den, following the link: ","Click here for Manual Adjusments"]
[null,null,3,"Save a copy of the template on your desktop."]
[null,null,4,"Copy only the cells under the grey headers below onto the UPS template, as the yellow headers are pre-populated in the template / or press the copy button (which would copy the data from the form), Open up the Template, Click Paste special --> Tick Values --> Tick Skip Blanks --> Press Ok. "]
[]
[null,null,5,"Follow the 'How to complete a template guidance' on the Finance Den."]
["Company","Company Line No.","Line No","Document Type","Vendor Number","Provider Name","Parent/Child","UKPRN","UPIN","Funding Type Code","Values excl. VAT","Posting Date ","Due Date","External Document Number","Ext. Ref. 5\nRemittance Comments","Category Code Name","Category Code","Index","Cost Centre Code\nDimension 2","G/L Account Code","VAT Code","Activity Code","Analysis Code","Grant Type Description","Grant Type","Ext. Ref. 6\n"]
["DFE Core STA TRA",{"$f":"A9&C9","v":"DFE Core STA TRA"},null,{"$f":"IFERROR(VLOOKUP(B9,'System-Business Refrence'!$B$2:$L$12,2,0),\"\")","v":""},{"$f":"IFERROR(VLOOKUP(B9,'System-Business Refrence'!$B$2:$L$12,3,0),\"\")","v":""},null,null,null,null,{"$f":"IFERROR(VLOOKUP(B9,'System-Business Refrence'!$B$2:$L$12,4,0),\"\")","v":""},{"$f":"IFERROR(VLOOKUP(B9,'System-Business Refrence'!$B$2:$L$12,9,0),\"\")","v":""},{"$f":"IFERROR(VLOOKUP(B9,'System-Business Refrence'!$B$2:$L$12,11,0),\"\")","v":""},{"$f":"IFERROR(VLOOKUP(B9,'System-Business Refrence'!$B$2:$M$12,12,0),\"\")","v":""},null,{"$f":"IFERROR(VLOOKUP(B9,'System-Business Refrence'!$B$2:$L$12,10,0),\"\")","v":""},null,null,null,{"$f":"IFERROR(VLOOKUP(B9,'System-Business Refrence'!$B$2:$L$12,6,0),\"\")","v":""},null,null,{"$f":"IFERROR(VLOOKUP(B9,'System-Business Refrence'!$B$2:$M$12,8,0),\"\")","v":""},{"$f":"IFERROR(VLOOKUP(B9,'System-Business Refrence'!$B$2:$L$12,7,0),\"\")","v":""}]
["DFE Core STA TRA","DFE Core STA TRA",null,{"$f":"IFERROR(VLOOKUP(B10,'System-Business Refrence'!$B$2:$L$12,2,0),\"\")","v":""},{"$f":"IFERROR(VLOOKUP(B10,'System-Business Refrence'!$B$2:$L$12,3,0),\"\")","v":""},null,null,null,null,{"$f":"IFERROR(VLOOKUP(B10,'System-Business Refrence'!$B$2:$L$12,4,0),\"\")","v":""},{"$f":"IFERROR(VLOOKUP(B10,'System-Business Refrence'!$B$2:$L$12,9,0),\"\")","v":""},{"$f":"IFERROR(VLOOKUP(B10,'System-Business Refrence'!$B$2:$L$12,11,0),\"\")","v":""},{"$f":"IFERROR(VLOOKUP(B10,'System-Business Refrence'!$B$2:$M$12,12,0),\"\")","v":""},null,{"$f":"IFERROR(VLOOKUP(B10,'System-Business Refrence'!$B$2:$L$12,10,0),\"\")","v":""},null,null,null,{"$f":"IFERROR(VLOOKUP(B10,'System-Business Refrence'!$B$2:$L$12,6,0),\"\")","v":""},null,null,{"$f":"IFERROR(VLOOKUP(B10,'System-Business Refrence'!$B$2:$M$12,8,0),\"\")","v":""},{"$f":"IFERROR(VLOOKUP(B10,'System-Business Refrence'!$B$2:$L$12,7,0),\"\")","v":""}]
{"$rows_left_out":11}
{"sheet":"System-Business Refrence","index":7,"n_rows":18,"n_cols":13,"rows_kept":18,"cut":false,"hidden":true,"merged":[]}
[null,1,2,3,4,5,6,7,8,9,10,11,12]
[null,"Company Line No.","Document Type","Vendor Number","Funding Type Code","Account Codes","Cost Center","Analysis Code","Activity Code","Amount","Purpose and Location Expenses","Posting Date","Due Date"]
[null,{"$f":"'NSEC-F'!C51&'NSEC-F'!B51","v":"DFE Core STA TRA1"},"Invoice",{"$f":"rVendorNumber","v":"P0109089"},"NONEMPEXP",{"$f":"'NSEC-F'!M51","v":" - Other Travel - Mileage"},{"$f":"'NSEC-F'!J51","v":10292},null,null,{"$f":"'NSEC-F'!Z51","v":56.07},{"$f":"\"NSECF_\"&rVendorNumber&\"_\"&rName&\"_\"&'NSEC-F'!D15&\"\"","v":"NSECF_P0109089_Peter Bryan_TPSPB Subcommittee Meeting"},{"$f":"'NSEC-F'!$AE$65","v":"2025-03-24T11:07:30"},{"$f":"'NSEC-F'!$I$48","v":"2025-03-26"}]
[null,{"$f":"'NSEC-F'!C52&'NSEC-F'!B52","v":"DFE Core STA TRA2"},"Invoice","P0109089","NONEMPEXP",{"$f":"'NSEC-F'!M52","v":" - Other Travel"},{"$f":"'NSEC-F'!J52","v":10292},null,null,{"$f":"'NSEC-F'!Z52","v":6},{"$f":"\"NSECF_\"&rVendorNumber&\"_\"&rName&\"_\"&'NSEC-F'!D16&\"\"","v":"NSECF_P0109089_Peter Bryan_Parking"},{"$f":"'NSEC-F'!$AE$65","v":"2025-03-24T11:07:30"},{"$f":"'NSEC-F'!$I$48","v":"2025-03-26"}]
[null,{"$f":"'NSEC-F'!C53&'NSEC-F'!B53","v":"DFE Core STA TRA3"},"Invoice","P0109089","NONEMPEXP",{"$f":"'NSEC-F'!M53","v":" - Subsistence"},{"$f":"'NSEC-F'!J53","v":10292},null,null,{"$f":"'NSEC-F'!Z53","v":11.8},{"$f":"\"NSECF_\"&rVendorNumber&\"_\"&rName&\"_\"&'NSEC-F'!D17&\"\"","v":"NSECF_P0109089_Peter Bryan_Subsistence"},{"$f":"'NSEC-F'!$AE$65","v":"2025-03-24T11:07:30"},{"$f":"'NSEC-F'!$I$48","v":"2025-03-26"}]
[null,{"$f":"'NSEC-F'!C54&'NSEC-F'!B54","v":"4"},"Invoice","P0109089","NONEMPEXP",{"$f":"'NSEC-F'!M54","v":0},{"$f":"'NSEC-F'!J54","v":0},null,null,{"$f":"'NSEC-F'!Z54","v":0},{"$f":"\"NSECF_\"&rVendorNumber&\"_\"&rName&\"_\"&'NSEC-F'!D18&\"\"","v":"NSECF_P0109089_Peter Bryan_"},{"$f":"'NSEC-F'!$AE$65","v":"2025-03-24T11:07:30"},{"$f":"'NSEC-F'!$I$48","v":"2025-03-26"}]
[null,{"$f":"'NSEC-F'!C55&'NSEC-F'!B55","v":"5"},"Invoice","P0109089","NONEMPEXP",{"$f":"'NSEC-F'!M55","v":0},{"$f":"'NSEC-F'!J55","v":0},null,null,{"$f":"'NSEC-F'!Z55","v":0},{"$f":"\"NSECF_\"&rVendorNumber&\"_\"&rName&\"_\"&'NSEC-F'!D19&\"\"","v":"NSECF_P0109089_Peter Bryan_"},{"$f":"'NSEC-F'!$AE$65","v":"2025-03-24T11:07:30"},{"$f":"'NSEC-F'!$I$48","v":"2025-03-26"}]
[null,{"$f":"'NSEC-F'!C56&'NSEC-F'!B56","v":"6"},"Invoice","P0109089","NONEMPEXP",{"$f":"'NSEC-F'!M56","v":0},{"$f":"'NSEC-F'!J56","v":0},null,null,{"$f":"'NSEC-F'!Z56","v":0},{"$f":"\"NSECF_\"&rVendorNumber&\"_\"&rName&\"_\"&'NSEC-F'!D20&\"\"","v":"NSECF_P0109089_Peter Bryan_"},{"$f":"'NSEC-F'!$AE$65","v":"2025-03-24T11:07:30"},{"$f":"'NSEC-F'!$I$48","v":"2025-03-26"}]
[null,{"$f":"'NSEC-F'!C57&'NSEC-F'!B57","v":"7"},"Invoice","P0109089","NONEMPEXP",{"$f":"'NSEC-F'!M57","v":0},{"$f":"'NSEC-F'!J57","v":0},null,null,{"$f":"'NSEC-F'!Z57","v":0},{"$f":"\"NSECF_\"&rVendorNumber&\"_\"&rName&\"_\"&'NSEC-F'!D21&\"\"","v":"NSECF_P0109089_Peter Bryan_"},{"$f":"'NSEC-F'!$AE$65","v":"2025-03-24T11:07:30"},{"$f":"'NSEC-F'!$I$48","v":"2025-03-26"}]
[null,{"$f":"'NSEC-F'!C58&'NSEC-F'!B58","v":"8"},"Invoice","P0109089","NONEMPEXP",{"$f":"'NSEC-F'!M58","v":0},{"$f":"'NSEC-F'!J58","v":0},null,null,{"$f":"'NSEC-F'!Z58","v":0},{"$f":"\"NSECF_\"&rVendorNumber&\"_\"&rName&\"_\"&'NSEC-F'!D22&\"\"","v":"NSECF_P0109089_Peter Bryan_"},{"$f":"'NSEC-F'!$AE$65","v":"2025-03-24T11:07:30"},{"$f":"'NSEC-F'!$I$48","v":"2025-03-26"}]
{"$rows_left_out":9}
{"sheet":"System-AccountCode","index":8,"n_rows":32,"n_cols":7,"rows_kept":32,"cut":false,"hidden":true,"merged":[]}
["Category","Account codes",null,"Temp","Account Code Name","Category Code","ESFA Account Code"]
[null,5215303000,"EXP - PURCH OF GDS/SERV - OTHER FACILITIES COSTS - CONFS, EXHIBITIONS AND EVENTS","EXP - PURCH OF GDS/SERV - OTHER FACILITIES COSTS - CONFS, EXHIBITIONS AND EVENTS",{"$f":"A2&\" - \" &PROPER(D2)","v":" - Exp - Purch Of Gds/Serv - Other Facilities Costs - Confs, Exhibitions And Events"}]
[null,5212103003,"EXP - PURCH OF GDS/SERV - PERSONNEL RELATED - CHILDCARE MNGMT FEES & SUBS COSTS","EXP - PURCH OF GDS/SERV - PERSONNEL RELATED - CHILDCARE MNGMT FEES & SUBS COSTS"," - Exp - Purch Of Gds/Serv - Personnel Related - Childcare Mngmt Fees & Subs Costs"]
[null,5212103001,"EXP - PURCH OF GDS/SERV - PERSONNEL RELATED - SUBSCRIPTION TO PROF BODIES","EXP - PURCH OF GDS/SERV - PERSONNEL RELATED - SUBSCRIPTION TO PROF BODIES"," - Exp - Purch Of Gds/Serv - Personnel Related - Subscription To Prof Bodies"]
[null,5212103002,"EXP - PURCH OF GDS/SERV - PERSONNEL RELATED - WELFARE SERVICES","EXP - PURCH OF GDS/SERV - PERSONNEL RELATED - WELFARE SERVICES"," - Exp - Purch Of Gds/Serv - Personnel Related - Welfare Services"]
[null,5219100000,"EXP - PURCHASE OF GOODS/SERVICES - AIR TRAVEL","AIR TRAVEL"," - Air Travel"]
[null,5215200000,"EXP - PURCHASE OF GOODS/SERVICES - CATERING & HOSPITALITY","CATERING & HOSPITALITY"," - Catering & Hospitality"]
[null,5215203001,"EXP - PURCHASE OF GOODS/SERVICES - CATERING & HOSPITALITY - MEETING REFRESHMENTS","CATERING & HOSPITALITY - MEETING REFRESHMENTS"," - Catering & Hospitality - Meeting Refreshments"]
[null,5215203002,"EXP - PURCHASE OF GOODS/SERVICES - CATERING & HOSPITALITY - WORKING LUNCHES","CATERING & HOSPITALITY - WORKING LUNCHES"," - Catering & Hospitality - Working Lunches"]
[null,5219600001,"EXP - PURCHASE OF GOODS/SERVICES - COMMITTEE EXPENSES","COMMITTEE EXPENSES"," - Committee Expenses"]
{"$rows_left_out":22}