{"text_format":"1","workbook":"xlsx","n_sheets":129,"sheets":["Cover","Purpose of spreadsheet","Version Control","Summary - TPS_EW","AnnGenHiddenLists","Factor List","x-Series Number","x-101","x-202","x-203","x-204","x-205","x-206","x-207","x-208","x-209","x-210","x-211","x-212","x-213","x-214","x-215","x-216","x-217","x-218","x-219","x-220","x-221","x-222","x-224","x-225","x-226","x-231","x-232","x-233","x-234","x-235","x-236","x-237","x-238","x-239","x-240","x-301","x-302","x-303","x-304","x-305","x-306","x-307","x-308","x-309","x-310","x-311","x-312","x-313","x-314","x-315","x-316","x-317","x-318","x-319","x-320","x-321","x-322","x-323","x-324","x-401","x-402","x-403","x-404","x-405","x-406","x-407","x-408","x-409","x-410","x-411","x-412","x-413","x-414","x-501","x-502","x-503","x-504","x-505","x-601","x-602","x-603","x-604","x-605","x-606","x-607","x-608","x-609","x-610","x-611","x-702","x-703","x-704","x-705","x-706","x-707","x-708","x-709","x-710","x-711","x-712","x-713","x-714","x-715","x-716","x-717","x-718","x-719","x-720","x-721","x-722","x-723","x-724","x-725","x-726","x-727","x-728","x-729","x-801","x-802","x-803","x-804","x-805"],"not_rendered":{"charts":0,"images":0,"macros":1,"external_links":2,"defined_names":4006,"comments":0,"pivot_tables":0},"unopened":[],"bounds":{"document_bytes":16777216,"sheet_cells":100000,"rows_first":2000,"rows_last":500,"rows_between":2000,"halvings":0,"cell_chars":16384,"cell_head_chars":4096},"cells_cut":0,"cells_raw":0,"read":"whole","date_system":"1900"}

{"sheet":"Cover","index":0,"n_rows":22,"n_cols":2,"rows_kept":22,"cut":false,"hidden":false,"merged":[]}
["Government Actuary's Department"]
["TPS (England & Wales) - Consolidated Factor Spreadsheet"]
["Cover"]
[]
[]
[]
["Specification","This spreadsheet contains revised factors for the Teachers' Pension Scheme in England and Wales."]
[]
[]
[]
["Sheet","Description"]
["Purpose of spreadsheet","This sheet sets out the purpose of the spreadsheet and includes caveats on the use of the spreadsheet."]
["Version Control ","This sheet is used to show which factor tables have been updated since the last issued version of the consolidated factor spreadsheet."]
["Factor List","This sheet lists the suite of factors set out in this speadsheet."]
["x-101 and onwards","The 100 series factors contain the club transfer factors. Each different type of club transfer factor is set out on a separate sheet starting with sheet x-101, where x relates to the scheme section (if applicable)."]
["x-201 and onwards","The 200 series factors contain the non club transfer factors. Each different type of non club transfer factor is set out on a separate sheet starting with sheet x-201, where x relates to the scheme section (if applicable)."]
["x-301 and onwards","The 300 series factors contain the pension sharing on divorce factors. Each different type of pension sharing on divorce factor is set out on a separate sheet starting with sheet x-301, where x relates to the scheme section (if applicable)."]
["x-401 and onwards","The 400 series factors contain the early and late retirement factors. Each different type of early or late retirement factor is set out on a separate sheet starting with sheet x-401, where x relates to the scheme section (if applicable)."]
["x-501 and onwards","The 500 series factors contain the commutation factors. Each different type of commutation factor is set out on a separate sheet starting with sheet x-501, where x relates to the scheme section (if applicable)."]
["x-601 and onwards","The 600 series factors contain the scheme pays factors. Each different type of scheme pays factor is set out on a separate sheet starting with sheet x-601, where x relates to the scheme section (if applicable)."]
["x-701 and onwards","The 700 series factors contain the additional benefit or additional contribution factors. Each different type of additional benefit or additional contribution factor is set out on a separate sheet starting with sheet x-701, where x relates to the scheme section (if applicable)."]
["x-801 and onwards","The 800 series factors contain the other scheme specific factors. Each different type of other scheme specific factor is set out on a separate sheet starting with sheet x-801, where x relates to the scheme section (if applicable)."]

{"sheet":"Purpose of spreadsheet","index":1,"n_rows":9,"n_cols":1,"rows_kept":9,"cut":false,"hidden":false,"merged":[[6,0,6,12],[8,0,11,12]]}
["Government Actuary's Department"]
[{"$f":"IF(title=\"> Enter workbook title here\",\"Enter workbook title in Cover sheet\",title)","v":"TPS (England & Wales) - Consolidated Factor Spreadsheet"}]
["Purpose of Spreadsheet"]
[]
[]
[]
["Purpose of the TPS (England and Wales) Consolidated Factor Spreadsheet"]
[]
["This spreadsheet is provided by GAD at the request of the Department for Education (\"DfE\").  Its purpose is to set out in one place for convenience the actuarial factors provided by GAD to DfE from time to time in respect of Teachers' Pension Scheme in England and Wales and related schemes, and the dates on which these factors have been sent to the client and implemented by the client.  It should not be used or relied on for any other purpose and GAD has no liability for any act or omission taken on the basis of this spreadsheet.  In particular, it does not constitute an instruction or manual for plan administration purposes, and it does not cover the implementation or backdating of factors other than to specify the factor implementation date (if provided by DfE).   \n\nGAD has no liability for any changes made to this spreadsheet whilst being used by DfE or any other third party.\n\nThis spreadsheet should not be made available online without the express permission of GAD. \n\nThis spreadsheet is password protected. "]

{"sheet":"Version Control","index":2,"n_rows":87,"n_cols":3,"rows_kept":87,"cut":false,"hidden":false,"merged":[]}
["Government Actuary's Department"]
[{"$f":"IF(title=\"> Enter workbook title here\",\"Enter workbook title in Cover sheet\",title)","v":"TPS (England & Wales) - Consolidated Factor Spreadsheet"}]
["Version Control"]
[]
[]
["Version control"]
[]
["This sheet is intended to assist DfE in understanding which factors have changed and when. "]
["Version control on this sheet commences with the 2017/18 factor review (version 2018-1)"]
[]
["Version 2018-1 (November 2018)"]
["Provides the following new factor tables:",null,"None"]
["Provides the following revised factors:",null,"x-200 series (part) and x-300 series (part)"]
["Confirms that the following factor table is no longer required by DfE:",null,"None"]
["Factors still to follow:",null,"All other series"]
["Methodology changes:",null,"None - tables should be used with existing guidance notes as referenced"]
["Date modified:",null,"2018-11-09T10:22:45"]
[]
["Version 2018-2 (December 2018)"]
["Provides the following new factor tables:",null,"None"]
["Provides the following revised factors:",null,"x-400 series (part)"]
["Confirms that the following factor table is no longer required by DfE:",null,"None"]
["Factors still to follow:",null,"x-100, x-500, x-600, x-700 and x-800 series (all)\nx-200, x-300 and x-400 series (part)"]
["Methodology changes:",null,"None - tables should be used with existing guidance notes as referenced"]
["Date modified:",null,"2018-12-06"]
[]
["Version 2018-3 (December 2018)"]
["Provides the following new factor tables:",null,"None"]
["Provides the following revised factors:",null,"x-200, x-300 and x-500 series (all)\nx-800 series (part)\nTable x-408 (revised)"]
["Confirms that the following factor table is no longer required by DfE:",null,"None"]
["Factors still to follow:",null,"x-100, x-600 and x-700 series (all)\nx-400 and x-800 series (part)"]
["Methodology changes:",null,"None - tables should be used with existing guidance notes as referenced"]
["Date modified:",null,"2018-12-21"]
[]
["Version 2019-1 (February 2019)"]
["Provides the following new factor tables:",null,"None"]
["Provides the following revised factors:",null,"x-600 and x-700 series (all)\nx-800 series (all remaining factors)"]
["Confirms that the following factor table is no longer required by DfE:",null,"None"]
["Factors still to follow:",null,"x-100 (all)\nx-400 (part)"]
["Methodology changes:",null,"None - tables should be used with existing guidance notes as referenced"]
["Date modified:",null,"2019-02-06"]
[]
["Version 2019-2 (March 2019)"]
["Provides the following new factor tables:",null,"None"]
["Provides the following revised factors:",null,"x-100 series (all)"]
["Confirms that the following factor table is no longer required by DfE:",null,"None"]
["Factors still to follow:",null,"x-400 (part)"]
["Methodology changes:",null,"None - tables should be used with existing guidance notes as referenced"]
["Date modified:",null,"2019-03-01"]
[]
["Version 2019-3 (April 2019)"]
["Provides the following new factor tables:",null,"None"]
["Provides the following revised factors:",null,"None"]
["Other changes",null,"Corrected date of 'Associated Guidance Note' for tables x-610 and x-611"]
["Confirms that the following factor table is no longer required by DfE:",null,"None"]
["Factors still to follow:",null,"x-400 (part)"]
["Methodology changes:",null,"None - tables should be used with existing guidance notes as referenced"]
["Date modified:",null,"2019-04-05"]
[]
["Version 2023-01"]
["Provides the following new factor tables:"]
["Provides the following updated factor tables:",null,"x-202 to x-226,\nx-301 to x-324,\nRemoved x-201 (GMP) and x-223 (Protected Rights)"]
["Factors still to follow:"]
["Methodology changes:"]
["Date Modified:",null,"2023-05-26"]
[]
["Version 2023-02"]
["Provides the following new factor tables:"]
["Provides the following updated factor tables:",null,"x-401 to x-414 \nx-231 to x-240"]
["Withdrawn factor tables:",null,"x-227 to x-230 removed (final salary TV in factors)"]
["Methodology changes:"]
["Date Modified:",null,"2023-06-30"]
[]
["Version 2023-03"]
["Provides the following new factor tables:"]
["Provides the following updated factor tables:",null,"x-501 to x-505 \nx-601 to x-611 \nx-801 to x-802"]
["Withdrawn factor tables: "]
["Methodology changes:"]
["Date Modified:",null,"2023-07-28"]
[]
[]
["Version 2023-04"]
["Provides the following new factor tables:",null,"x-805 (pension mis-selling factors),\nx-729 (table BO3)\n"]
["Provides the following updated factor tables:",null,"x-101,\nx-702 to x-721,\nx-722 to x-723\nx-724 to x-728,\nx-803 to x-804\n"]
["Withdrawn factor tables:",null,"x-701"]
["Methodology changes:"]
["Date Modified:",null,"2023-10-17"]

{"sheet":"Summary - TPS_EW","index":3,"n_rows":224,"n_cols":6,"rows_kept":224,"cut":false,"hidden":true,"merged":[]}
["Government Actuary's Department"]
[{"$f":"IF(title=\"> Enter workbook title here\",\"Enter workbook title in Cover sheet\",title)","v":"TPS (England & Wales) - Consolidated Factor Spreadsheet"}]
["Summary of Factors "]
[{"$f":"CELL(\"filename\",A1)","v":"https://capita-my.sharepoint.com/personal/p10015177_capita_co_uk/Documents/Documents/SPA Stuff/Factor Changes/Batch 4 Factors/[TPS EW Consolidated Factors 2023-04.xlsm]Summary - TPS_EW"}]
[]
[]
[null,null,null,null,"x=0","x=1"]
[null,"TPS_EW",null,null,"Career Average","Final Salary"]
[]
[null,"100 Series - Club Transfer"]
[null,"x-",101]
[null,"x-",102]
[null,"x-",103]
[null,"x-",104]
[null,"x-",105]
[null,"x-",106]
[null,"x-",107]
[null,"x-",108]
[null,"x-",109]
[null,"x-",110]
[null,"x-",111]
[null,"x-",112]
[null,"x-",113]
[null,"x-",114]
[null,"x-",115]
[null,"x-",116]
[null,"x-",117]
[null,"x-",118]
[null,"x-",119]
[null,"x-",120]
[null,"x-",121]
[null,"x-",122]
[null,"x-",123]
[null,"x-",124]
[null,"x-",125]
[]
[null,"200 Series - Non Club Transfers"]
[null,"x-",201]
[null,"x-",202]
[null,"x-",203]
[null,"x-",204]
[null,"x-",205]
[null,"x-",206]
[null,"x-",207]
[null,"x-",208]
[null,"x-",209]
[null,"x-",210]
[null,"x-",211]
[null,"x-",212]
[null,"x-",213]
[null,"x-",214]
[null,"x-",215]
[null,"x-",216]
[null,"x-",217]
[null,"x-",218]
[null,"x-",219]
[null,"x-",220]
[null,"x-",221]
[null,"x-",222]
[null,"x-",223]
[null,"x-",224]
[null,"x-",225]
[]
[null,"300 Series - Pension Sharing on divorce"]
[null,"x-",301]
[null,"x-",302]
[null,"x-",303]
[null,"x-",304]
[null,"x-",305]
[null,"x-",306]
[null,"x-",307]
[null,"x-",308]
[null,"x-",309]
[null,"x-",310]
[null,"x-",311]
[null,"x-",312]
[null,"x-",313]
[null,"x-",314]
[null,"x-",315]
[null,"x-",316]
[null,"x-",317]
[null,"x-",318]
[null,"x-",319]
[null,"x-",320]
[null,"x-",321]
[null,"x-",322]
[null,"x-",323]
[null,"x-",324]
[null,"x-",325]
[]
[null,"400 Series - Early or Late Retirement"]
[null,"x-",401]
[null,"x-",402]
[null,"x-",403]
[null,"x-",404]
[null,"x-",405]
[null,"x-",406]
[null,"x-",407]
[null,"x-",408]
[null,"x-",409]
[null,"x-",410]
[null,"x-",411]
[null,"x-",412]
[null,"x-",413]
[null,"x-",414]
[null,"x-",415]
[null,"x-",416]
[null,"x-",417]
[null,"x-",418]
[null,"x-",419]
[null,"x-",420]
[null,"x-",421]
[null,"x-",422]
[null,"x-",423]
[null,"x-",424]
[null,"x-",425]
[]
[null,"500 Series - Commutation"]
[null,"x-",501]
[null,"x-",502]
[null,"x-",503]
[null,"x-",504]
[null,"x-",505]
[null,"x-",506]
[null,"x-",507]
[null,"x-",508]
[null,"x-",509]
[null,"x-",510]
[null,"x-",511]
[null,"x-",512]
[null,"x-",513]
[null,"x-",514]
[null,"x-",515]
[null,"x-",516]
[null,"x-",517]
[null,"x-",518]
[null,"x-",519]
[null,"x-",520]
[null,"x-",521]
[null,"x-",522]
[null,"x-",523]
[null,"x-",524]
[null,"x-",525]
[]
[null,"600 Series - Scheme Pays"]
[null,"x-",601]
[null,"x-",602]
[null,"x-",603]
[null,"x-",604]
[null,"x-",605]
[null,"x-",606]
[null,"x-",607]
[null,"x-",608]
[null,"x-",609]
[null,"x-",610]
[null,"x-",611]
[null,"x-",612]
[null,"x-",613]
[null,"x-",614]
[null,"x-",615]
[null,"x-",616]
[null,"x-",617]
[null,"x-",618]
[null,"x-",619]
[null,"x-",620]
[null,"x-",621]
[null,"x-",622]
[null,"x-",623]
[null,"x-",624]
[null,"x-",625]
[]
[null,"700 Series - Additional Benefits or Additional Contributions"]
[null,"x-",701]
[null,"x-",702]
[null,"x-",703]
[null,"x-",704]
[null,"x-",705]
[null,"x-",706]
[null,"x-",707]
[null,"x-",708]
[null,"x-",709]
[null,"x-",710]
[null,"x-",711]
[null,"x-",712]
[null,"x-",713]
[null,"x-",714]
[null,"x-",715]
[null,"x-",716]
[null,"x-",717]
[null,"x-",718]
[null,"x-",719]
[null,"x-",720]
[null,"x-",721]
[null,"x-",722]
[null,"x-",723]
[null,"x-",724]
[null,"x-",725]
[]
[null,"800 Series - Other Scheme Specific"]
[null,"x-",801]
[null,"x-",802]
[null,"x-",803]
[null,"x-",804]
[null,"x-",805]
[null,"x-",806]
[null,"x-",807]
[null,"x-",808]
[null,"x-",809]
[null,"x-",810]
[null,"x-",811]
[null,"x-",812]
[null,"x-",813]
[null,"x-",814]
[null,"x-",815]
[null,"x-",816]
[null,"x-",817]
[null,"x-",818]
[null,"x-",819]
[null,"x-",820]
[null,"x-",821]
[null,"x-",822]
[null,"x-",823]
[null,"x-",824]
[null,"x-",825]

{"sheet":"AnnGenHiddenLists","index":4,"n_rows":160,"n_cols":3,"rows_kept":160,"cut":false,"hidden":true,"merged":[]}
["DO NOT REMOVE WORKSHEET"]
[]
["BaseTablesList",null,"ImprovementsList"]
["PCFA00",null,"CMI2016F-07-1pt5"]
["PCMA00",null,"CMI2016M-07-1pt5"]
["PFA80",null,"Long Cohort"]
["PFA92",null,"Medium Cohort"]
["PFA92 - 08",null,"PFA80imp"]
["PFA92-10",null,"PFA92"]
["PMA80",null,"PMA80imp"]
["PMA92",null,"PMA92"]
["PMA92 - 08",null,"Short Cohort"]
["PMA92-10",null,"SMPI-2018imp"]
["PNFA00",null,"UKF2004imp"]
["PNFA00-06",null,"UKF2006imp"]
["PNFA00-08",null,"UKF2006imp_HLE"]
["PNFA00-10",null,"UKF2006imp_LLE"]
["PNMA00",null,"UKF2008imp"]
["PNMA00-06",null,"UKF2010imp"]
["PNMA00-08",null,"UKF2012imp"]
["PNMA00-10",null,"UKF2014imp"]
["S1DFA",null,"UKf2016HLEimp"]
["S1DFA-06",null,"UKF2016imp"]
["S1DFA-08",null,"UKf2016LLEimp"]
["S1DFA-10",null,"UKM2004imp"]
["S1DFA-12",null,"UKM2006imp"]
["S1DFA-14",null,"UKM2006imp_HLE"]
["S1DFA-16",null,"UKM2006imp_LLE"]
["S1DFA-L",null,"UKM2008imp"]
["S1DFA-L-06",null,"UKM2010imp"]
["S1DFA-L-08",null,"UKM2012imp"]
["S1DFA-L-10",null,"UKM2014imp"]
["S1DFA-L-12",null,"UKm2016HLEimp"]
["S1IFA",null,"UKM2016imp"]
["S1IFA-06",null,"UKm2016LLEimp"]
["S1IFA-08",null,"None"]
["S1IFA-10"]
["S1IFA-12"]
["S1IFA-14"]
["S1IFA-16"]
["S1IFA-STSS-16"]
["S1IFA-TPS-16"]
["S1IMA"]
["S1IMA-06"]
["S1IMA-08"]
["S1IMA-10"]
["S1IMA-12"]
["S1IMA-14"]
["S1IMA-16"]
["S1IMA-STSS-16"]
["S1IMA-TPS-16"]
["S1NFA"]
["S1NFA-06"]
["S1NFA-08"]
["S1NFA-10"]
["S1NFA-12"]
["S1NFA-14"]
["S1NFA-16"]
["S1NFA-L"]
["S1NFA-L-06"]
["S1NFA-L-08"]
["S1NFA-L-10"]
["S1NFA-L-12"]
["S1NFA-L-14"]
["S1NFA-L-16"]
["S1NFA-L-STSS"]
["S1NFA-L-STSS-06"]
["S1NFA-L-STSS-08"]
["S1NFA-L-STSS-10"]
["S1NFA-L-STSS-12"]
["S1NFA-L-STSS-14"]
["S1NFA-L-STSS-16"]
["S1NFA-L-TPS"]
["S1NFA-L-TPS-06"]
["S1NFA-L-TPS-08"]
["S1NFA-L-TPS-10"]
["S1NFA-L-TPS-12"]
["S1NFA-L-TPS-14"]
["S1NFA-L-TPS-16"]
["S1NMA"]
["S1NMA-06"]
["S1NMA-08"]
["S1NMA-10"]
["S1NMA-12"]
["S1NMA-14"]
["S1NMA-16"]
["S1NMA-L"]
["S1NMA-L-06"]
["S1NMA-L-08"]
["S1NMA-L-10"]
["S1NMA-L-12"]
["S1NMA-L-14"]
["S1NMA-L-16"]
["S1PFA"]
["S1PFA-06"]
["S1PFA-08"]
["S1PFA-10"]
["S1PFA-12"]
["S1PFA-14"]
["S1PFA-16"]
["S1PMA"]
["S1PMA-06"]
["S1PMA-08"]
["S1PMA-10"]
["S1PMA-12"]
["S1PMA-14"]
["S1PMA-16"]
["S2DFA"]
["S2DFA-12"]
["S2DFA-14"]
["S2DFA-16"]
["S2DFL"]
["S2DFL-12"]
["S2DFL-16"]
["S2IFA"]
["S2IFA-12"]
["S2IFA-14"]
["S2IFA-16"]
["S2IMA"]
["S2IMA-12"]
["S2IMA-14"]
["S2IMA-16"]
["S2NFA"]
["S2NFA-12"]
["S2NFA-14"]
["S2NFA-16"]
["S2NFA-CMI"]
["S2NMA"]
["S2NMA_L-16"]
["S2NMA-12 "]
["S2NMA-14"]
["S2NMA-16"]
["S2NMA-CMI"]
["S2PFA"]
["S2PFA-12"]
["S2PFA-14"]
["S2PFA-16"]
["S2PFL"]
["S2PFL-12"]
["S2PFL-16"]
["S2PMA"]
["S2PMA-12"]
["S2PMA-14"]
["S2PMA-16"]
["S2PML"]
["S2PML-12"]
["S2PML-16"]
["SMPI-2018"]
["UKF"]
["UKF2004"]
["UKF2006"]
["UKF2008"]
["UKF2010"]
["UKF2012"]
["UKM"]
["UKM2004"]
["UKM2006"]
["UKM2008"]
["UKM2010"]
["UKM2012"]

{"sheet":"Factor List","index":5,"n_rows":130,"n_cols":18,"rows_kept":130,"cut":false,"hidden":false,"merged":[]}
["Government Actuary's Department"]
[{"$f":"IF(title=\"> Enter workbook title here\",\"Enter workbook title in Cover sheet\",title)","v":"TPS (England & Wales) - Consolidated Factor Spreadsheet"}]
["Factor List"]
[]
[]
[]
["Unique Table Reference / Sheet Name","Section","Factor Type","Description","Gender","Factor Age/Period Definition","Section Number (x)","Series Number","Table Reference\n(Section-Series Number)","Table Reference in Guidance","Associated Guidance Note","Date Factors Issued to Client","Date Factors Implemented (if known)","Factor Status","Factor Status","Source","UserID","Time Stamp"]
["Click to go to the relevant factors",null,null,"Filter by factor type"]
[{"$f":"HYPERLINK(\"#'x-\"&H9 & \"'!A1\",\"x-\"&H9)","v":"x-101"},"Career Average","Club Transfer Adjustments","Club transfer credit adjustment factors","Male & Female","Age last birthday",0,101,"0-101","Table CTC1","Teachers' Pension Scheme: Career average section\nClub transfers (supplement to the Club Memorandum): Factors and guidance\nDate: 25 October 2019","2023-10-17",null,"Issued"]
["x-202","Final Salary","CETV","CETV factors for men, normal pension age of 60","Male","Age last birthday at relevant date",1,202,"1-202","Table 103","Teachers' Pension Scheme: Final salary sections and career average section\nCash Equivalent Transfer Values (CETVs): Factors and Guidance\nDate: 27 October 2019","2023-05-26",null,"Issued",null,"\\\\Gad-ast\\ast\\Factors\\2017\\TPS_EW\\Client output\\Tranche 1_2.4%\\CETV bespoke outputs TPS EW - A + B - C v0.11_SCAPE 2.4%.xlsm","Tadeos","2018-11-06T17:00:34"]
["x-203","Final Salary","CETV","CETV factors for women, normal pension age of 60","Female","Age last birthday at relevant date",1,203,"1-203","Table 113","Teachers' Pension Scheme: Final salary sections and career average section\nCash Equivalent Transfer Values (CETVs): Factors and Guidance\nDate: 27 October 2019","2023-05-26",null,"Issued",null,"\\\\Gad-ast\\ast\\Factors\\2017\\TPS_EW\\Client output\\Tranche 1_2.4%\\CETV bespoke outputs TPS EW - A + B - C v0.11_SCAPE 2.4%.xlsm","Tadeos","2018-11-06T17:00:34"]
["x-204","All","CETV","CETV factors for men, normal pension age of 65","Male","Age last birthday at relevant date",0,204,"0-204","Table 123","Teachers' Pension Scheme: Final salary sections and career average section\nCash Equivalent Transfer Values (CETVs): Factors and Guidance\nDate: 27 October 2019","2023-05-26",null,"Issued",null,"\\\\Gad-ast\\ast\\Factors\\2017\\TPS_EW\\Client output\\Tranche 1_2.4%\\CETV bespoke outputs TPS EW - A + B - C v0.11_SCAPE 2.4%.xlsm","Tadeos","2018-11-06T17:00:34"]
["x-205","All","CETV","CETV factors for women, normal pension age of 65 - ages 20 to 59","Female","Age last birthday at relevant date",0,205,"0-205","Table 133a","Teachers' Pension Scheme: Final salary sections and career average section\nCash Equivalent Transfer Values (CETVs): Factors and Guidance\nDate: 27 October 2019","2023-05-26",null,"Issued",null,"\\\\Gad-ast\\ast\\Factors\\2017\\TPS_EW\\Client output\\Tranche 1_2.4%\\CETV bespoke outputs TPS EW - A + B - C v0.11_SCAPE 2.4%.xlsm","Tadeos","2018-11-06T17:00:34"]
["x-206","All","CETV","CETV factors for women, normal pension age of 65 - ages 60 to 64","Female","Age last birthday at relevant date",0,206,"0-206","Table 133b","Teachers' Pension Scheme: Final salary sections and career average section\nCash Equivalent Transfer Values (CETVs): Factors and Guidance\nDate: 27 October 2019","2023-05-26",null,"Issued",null,"\\\\Gad-ast\\ast\\Factors\\2017\\TPS_EW\\Client output\\Tranche 1_2.4%\\CETV bespoke outputs TPS EW - A + B - C v0.11_SCAPE 2.4%.xlsm","Tadeos","2018-11-06T17:00:34"]
["x-207","Career Average","CETV","CETV factors for men, normal pension age of 66 - ages 20 to 64","Male","Age last birthday at relevant date",0,207,"0-207","Table 143a","Teachers' Pension Scheme: Final salary sections and career average section\nCash Equivalent Transfer Values (CETVs): Factors and Guidance\nDate: 27 October 2019","2023-05-26",null,"Issued",null,"\\\\Gad-ast\\ast\\Factors\\2017\\TPS_EW\\Client output\\Tranche 1_2.4%\\CETV bespoke outputs TPS EW - A + B - C v0.11_SCAPE 2.4%.xlsm","Tadeos","2018-11-06T17:00:34"]
["x-208","Career Average","CETV","CETV factors for men, normal pension age of 66 - age 65","Male","Age last birthday at relevant date",0,208,"0-208","Table 143b","Teachers' Pension Scheme: Final salary sections and career average section\nCash Equivalent Transfer Values (CETVs): Factors and Guidance\nDate: 27 October 2019","2023-05-26",null,"Issued",null,"\\\\Gad-ast\\ast\\Factors\\2017\\TPS_EW\\Client output\\Tranche 1_2.4%\\CETV bespoke outputs TPS EW - A + B - C v0.11_SCAPE 2.4%.xlsm","Tadeos","2018-11-06T17:00:34"]
["x-209","Career Average","CETV","CETV factors for women, normal pension age of 66 - ages 20 to 59","Female","Age last birthday at relevant date",0,209,"0-209","Table 153a","Teachers' Pension Scheme: Final salary sections and career average section\nCash Equivalent Transfer Values (CETVs): Factors and Guidance\nDate: 27 October 2019","2023-05-26",null,"Issued",null,"\\\\Gad-ast\\ast\\Factors\\2017\\TPS_EW\\Client output\\Tranche 1_2.4%\\CETV bespoke outputs TPS EW - A + B - C v0.11_SCAPE 2.4%.xlsm","Tadeos","2018-11-06T17:00:34"]
["x-210","Career Average","CETV","CETV factors for women, normal pension age of 66 - ages 60 to 65","Female","Age last birthday at relevant date",0,210,"0-210","Table 153b","Teachers' Pension Scheme: Final salary sections and career average section\nCash Equivalent Transfer Values (CETVs): Factors and Guidance\nDate: 27 October 2019","2023-05-26",null,"Issued",null,"\\\\Gad-ast\\ast\\Factors\\2017\\TPS_EW\\Client output\\Tranche 1_2.4%\\CETV bespoke outputs TPS EW - A + B - C v0.11_SCAPE 2.4%.xlsm","Tadeos","2018-11-06T17:00:34"]
["x-211","Career Average","CETV","CETV factors for men, normal pension age of 67 - ages 20 to 64","Male","Age last birthday at relevant date",0,211,"0-211","Table 163a","Teachers' Pension Scheme: Final salary sections and career average section\nCash Equivalent Transfer Values (CETVs): Factors and Guidance\nDate: 27 October 2019","2023-05-26",null,"Issued",null,"\\\\Gad-ast\\ast\\Factors\\2017\\TPS_EW\\Client output\\Tranche 1_2.4%\\CETV bespoke outputs TPS EW - A + B - C v0.11_SCAPE 2.4%.xlsm","Tadeos","2018-11-06T17:00:34"]
["x-212","Career Average","CETV","CETV factors for men, normal pension age of 67 - ages 65 to 66","Male","Age last birthday at relevant date",0,212,"0-212","Table 163b","Teachers' Pension Scheme: Final salary sections and career average section\nCash Equivalent Transfer Values (CETVs): Factors and Guidance\nDate: 27 October 2019","2023-05-26",null,"Issued",null,"\\\\Gad-ast\\ast\\Factors\\2017\\TPS_EW\\Client output\\Tranche 1_2.4%\\CETV bespoke outputs TPS EW - A + B - C v0.11_SCAPE 2.4%.xlsm","Tadeos","2018-11-06T17:00:34"]
["x-213","Career Average","CETV","CETV factors for women, normal pension age of 67 - ages 20 to 59","Female","Age last birthday at relevant date",0,213,"0-213","Table 173a","Teachers' Pension Scheme: Final salary sections and career average section\nCash Equivalent Transfer Values (CETVs): Factors and Guidance\nDate: 27 October 2019","2023-05-26",null,"Issued",null,"\\\\Gad-ast\\ast\\Factors\\2017\\TPS_EW\\Client output\\Tranche 1_2.4%\\CETV bespoke outputs TPS EW - A + B - C v0.11_SCAPE 2.4%.xlsm","Tadeos","2018-11-06T17:00:34"]
["x-214","Career Average","CETV","CETV factors for women, normal pension age of 67 - ages 60 to 66","Female","Age last birthday at relevant date",0,214,"0-214","Table 173b","Teachers' Pension Scheme: Final salary sections and career average section\nCash Equivalent Transfer Values (CETVs): Factors and Guidance\nDate: 27 October 2019","2023-05-26",null,"Issued",null,"\\\\Gad-ast\\ast\\Factors\\2017\\TPS_EW\\Client output\\Tranche 1_2.4%\\CETV bespoke outputs TPS EW - A + B - C v0.11_SCAPE 2.4%.xlsm","Tadeos","2018-11-06T17:00:34"]
["x-215","Career Average","CETV","CETV factors for men, normal pension age of 68 - ages 20 to 64","Male","Age last birthday at relevant date",0,215,"0-215","Table 183a","Teachers' Pension Scheme: Final salary sections and career average section\nCash Equivalent Transfer Values (CETVs): Factors and Guidance\nDate: 27 October 2019","2023-05-26",null,"Issued",null,"\\\\Gad-ast\\ast\\Factors\\2017\\TPS_EW\\Client output\\Tranche 1_2.4%\\CETV bespoke outputs TPS EW - A + B - C v0.11_SCAPE 2.4%.xlsm","Tadeos","2018-11-06T17:00:34"]
["x-216","Career Average","CETV","CETV factors for men, normal pension age of 68 - ages 65 to 67","Male","Age last birthday at relevant date",0,216,"0-216","Table 183b","Teachers' Pension Scheme: Final salary sections and career average section\nCash Equivalent Transfer Values (CETVs): Factors and Guidance\nDate: 27 October 2019","2023-05-26",null,"Issued",null,"\\\\Gad-ast\\ast\\Factors\\2017\\TPS_EW\\Client output\\Tranche 1_2.4%\\CETV bespoke outputs TPS EW - A + B - C v0.11_SCAPE 2.4%.xlsm","Tadeos","2018-11-06T17:00:34"]
["x-217","Career Average","CETV","CETV factors for women, normal pension age of 68 - ages 20 to 59","Female","Age last birthday at relevant date",0,217,"0-217","Table 193a","Teachers' Pension Scheme: Final salary sections and career average section\nCash Equivalent Transfer Values (CETVs): Factors and Guidance\nDate: 27 October 2019","2023-05-26",null,"Issued",null,"\\\\Gad-ast\\ast\\Factors\\2017\\TPS_EW\\Client output\\Tranche 1_2.4%\\CETV bespoke outputs TPS EW - A + B - C v0.11_SCAPE 2.4%.xlsm","Tadeos","2018-11-06T17:00:34"]
["x-218","Career Average","CETV","CETV factors for women, normal pension age of 68 - ages 60 to 67","Female","Age last birthday at relevant date",0,218,"0-218","Table 193b","Teachers' Pension Scheme: Final salary sections and career average section\nCash Equivalent Transfer Values (CETVs): Factors and Guidance\nDate: 27 October 2019","2023-05-26",null,"Issued",null,"\\\\Gad-ast\\ast\\Factors\\2017\\TPS_EW\\Client output\\Tranche 1_2.4%\\CETV bespoke outputs TPS EW - A + B - C v0.11_SCAPE 2.4%.xlsm","Tadeos","2018-11-06T17:00:34"]
["x-219","All","CETV","CETV factors for men, NPA 60, AP in respect of an election on or before 22 June 2010","Male","Age last birthday at relevant date",0,219,"0-219","Table CEM60R","Teachers' Pension Scheme: Final salary sections and career average section\nCash Equivalent Transfer Values (CETVs): Factors and Guidance\nDate: 27 October 2019","2023-05-26",null,"Issued",null,"\\\\Gad-ast\\ast\\Factors\\2017\\TPS_EW\\Client output\\Tranche 1_2.4%\\CETV bespoke outputs TPS EW - A + B - C v0.11_SCAPE 2.4%.xlsm","Tadeos","2018-11-06T17:00:34"]
["x-220","All","CETV","CETV factors for women, NPA 60, AP in respect of election on or before 22 June 2010","Female","Age last birthday at relevant date",0,220,"0-220","Table CEF60R","Teachers' Pension Scheme: Final salary sections and career average section\nCash Equivalent Transfer Values (CETVs): Factors and Guidance\nDate: 27 October 2019","2023-05-26",null,"Issued",null,"\\\\Gad-ast\\ast\\Factors\\2017\\TPS_EW\\Client output\\Tranche 1_2.4%\\CETV bespoke outputs TPS EW - A + B - C v0.11_SCAPE 2.4%.xlsm","Tadeos","2018-11-06T17:00:34"]
["x-221","All","CETV","CETV factors for men, NPA 65, AP in respect of an election on or before 22 June 2010","Male","Age last birthday at relevant date",0,221,"0-221","Table CEM65R","Teachers' Pension Scheme: Final salary sections and career average section\nCash Equivalent Transfer Values (CETVs): Factors and Guidance\nDate: 27 October 2019","2023-05-26",null,"Issued",null,"\\\\Gad-ast\\ast\\Factors\\2017\\TPS_EW\\Client output\\Tranche 1_2.4%\\CETV bespoke outputs TPS EW - A + B - C v0.11_SCAPE 2.4%.xlsm","Tadeos","2018-11-06T17:00:34"]
["x-222","All","CETV","CETV factors for women, NPA 65, AP in respect of an election on or before 22 June 2010","Female","Age last birthday at relevant date",0,222,"0-222","Table CEF65R","Teachers' Pension Scheme: Final salary sections and career average section\nCash Equivalent Transfer Values (CETVs): Factors and Guidance\nDate: 27 October 2019","2023-05-26",null,"Issued",null,"\\\\Gad-ast\\ast\\Factors\\2017\\TPS_EW\\Client output\\Tranche 1_2.4%\\CETV bespoke outputs TPS EW - A + B - C v0.11_SCAPE 2.4%.xlsm","Tadeos","2018-11-06T17:00:34"]
["x-224","All","CETV","CETV factors for men above their NPA","Male","Age last birthday at relevant date",0,224,"0-224","Table 503","Teachers' Pension Scheme: Final salary sections and career average section\nCash Equivalent Transfer Values (CETVs) for ages above normal pension age: Factors and Guidance\nDate: 27 October 2019","2023-05-26",null,"Issued",null,"\\\\Gad-ast\\ast\\Factors\\2017\\TPS_EW\\Client output\\Tranche 1_2.4%\\CETV bespoke outputs TPS EW - A + B - C v0.11_SCAPE 2.4%.xlsm","Tadeos","2018-11-06T17:00:34"]
["x-225","All","CETV","CETV factors for women above their NPA","Female","Age last birthday at relevant date",0,225,"0-225","Table 513","Teachers' Pension Scheme: Final salary sections and career average section\nCash Equivalent Transfer Values (CETVs) for ages above normal pension age: Factors and Guidance\nDate: 27 October 2019","2023-05-26",null,"Issued",null,"\\\\Gad-ast\\ast\\Factors\\2017\\TPS_EW\\Client output\\Tranche 1_2.4%\\CETV bespoke outputs TPS EW - A + B - C v0.11_SCAPE 2.4%.xlsm","Tadeos","2018-11-06T17:00:34"]
["x-226","Career Average","CETV","Adjustment factor for CETV where a buy-out election applies","Unisex","Number of years and months for which the standard reduction has been bought-out",0,226,"0-226","Table AF1","Teachers' Pension Scheme: Final salary sections and career average section\nCash Equivalent Transfer Values (CETVs): Factors and Guidance\nDate: 27 October 2019","2023-05-26",null,"Issued",null,"\\\\Gad-ast\\ast\\Factors\\2017\\TPS_EW\\Client output\\Tranche 1_2.4%\\CETV bespoke outputs TPS EW - A + B - C v0.11_SCAPE 2.4%.xlsm","Meera","2018-11-09T10:22:42"]
["x-231","Career Average","TV In (non-club)","Factors for non-Club incoming transfers - men, NPA 65 (CARE)","Male","Age last birthday at relevant date",0,231,"0-231","Table CA_TVIN65M","Teachers' Pension Scheme: Final salary section and career average section\nNon-Club incoming transfers: Factors and guidance\nDate: 27 October 2019","2023-06-30",null,"Issued",null,"L:\\Factors\\2017\\TPS_EW\\Client output\\Tranche 2_2.4%\\CETV bespoke outputs TPS EW - A + B - C v0.11 (2.4% scape) with TVins.xlsm","Jessica","2018-12-04T10:20:51"]
[{"$f":"HYPERLINK(\"#'x-\"&H35 & \"'!A1\",\"x-\"&H35)","v":"x-232"},"Career Average","TV In (non-club)","Factors for non-Club incoming transfers - women, NPA 65 (CARE)","Female","Age last birthday at relevant date",0,232,"0-232","Table CA_TVIN65F","Teachers' Pension Scheme: Final salary section and career average section\nNon-Club incoming transfers: Factors and guidance\nDate: 27 October 2019","2023-06-30",null,"Issued",null,"L:\\Factors\\2017\\TPS_EW\\Client output\\Tranche 2_2.4%\\CETV bespoke outputs TPS EW - A + B - C v0.11 (2.4% scape) with TVins.xlsm","Jessica","2018-12-04T10:20:51"]
["x-233","Career Average","TV In (non-club)","Factors for non-Club incoming transfers - men, NPA 66 (CARE)","Male","Age last birthday at relevant date",0,233,"0-233","Table CA_TVIN66M","Teachers' Pension Scheme: Final salary section and career average section\nNon-Club incoming transfers: Factors and guidance\nDate: 27 October 2019","2023-06-30",null,"Issued",null,"L:\\Factors\\2017\\TPS_EW\\Client output\\Tranche 2_2.4%\\CETV bespoke outputs TPS EW - A + B - C v0.11 (2.4% scape) with TVins.xlsm","Jessica","2018-12-04T10:20:51"]
["x-234","Career Average","TV In (non-club)","Factors for non-Club incoming transfers - women, NPA 66 (CARE)","Female","Age last birthday at relevant date",0,234,"0-234","Table CA_TVIN66F","Teachers' Pension Scheme: Final salary section and career average section\nNon-Club incoming transfers: Factors and guidance\nDate: 27 October 2019","2023-06-30",null,"Issued",null,"L:\\Factors\\2017\\TPS_EW\\Client output\\Tranche 2_2.4%\\CETV bespoke outputs TPS EW - A + B - C v0.11 (2.4% scape) with TVins.xlsm","Jessica","2018-12-04T10:20:51"]
["x-235","Career Average","TV In (non-club)","Factors for non-Club incoming transfers - men, NPA 67 (CARE)","Male","Age last birthday at relevant date",0,235,"0-235","Table CA_TVIN67M","Teachers' Pension Scheme: Final salary section and career average section\nNon-Club incoming transfers: Factors and guidance\nDate: 27 October 2019","2023-06-30",null,"Issued",null,"L:\\Factors\\2017\\TPS_EW\\Client output\\Tranche 2_2.4%\\CETV bespoke outputs TPS EW - A + B - C v0.11 (2.4% scape) with TVins.xlsm","Jessica","2018-12-04T10:20:51"]
["x-236","Career Average","TV In (non-club)","Factors for non-Club incoming transfers - women, NPA 67 (CARE)","Female","Age last birthday at relevant date",0,236,"0-236","Table CA_TVIN67F","Teachers' Pension Scheme: Final salary section and career average section\nNon-Club incoming transfers: Factors and guidance\nDate: 27 October 2019","2023-06-30",null,"Issued",null,"L:\\Factors\\2017\\TPS_EW\\Client output\\Tranche 2_2.4%\\CETV bespoke outputs TPS EW - A + B - C v0.11 (2.4% scape) with TVins.xlsm","Jessica","2018-12-04T10:20:51"]
["x-237","Career Average","TV In (non-club)","Factors for non-Club incoming transfers - men, NPA 68 (CARE)","Male","Age last birthday at relevant date",0,237,"0-237","Table CA_TVIN68M","Teachers' Pension Scheme: Final salary section and career average section\nNon-Club incoming transfers: Factors and guidance\nDate: 27 October 2019","2023-06-30",null,"Issued",null,"L:\\Factors\\2017\\TPS_EW\\Client output\\Tranche 2_2.4%\\CETV bespoke outputs TPS EW - A + B - C v0.11 (2.4% scape) with TVins.xlsm","Jessica","2018-12-04T10:20:51"]
["x-238","Career Average","TV In (non-club)","Factors for non-Club incoming transfers - women, NPA 68 (CARE)","Female","Age last birthday at relevant date",0,238,"0-238","Table CA_TVIN68F","Teachers' Pension Scheme: Final salary section and career average section\nNon-Club incoming transfers: Factors and guidance\nDate: 27 October 2019","2023-06-30",null,"Issued",null,"L:\\Factors\\2017\\TPS_EW\\Client output\\Tranche 2_2.4%\\CETV bespoke outputs TPS EW - A + B - C v0.11 (2.4% scape) with TVins.xlsm","Jessica","2018-12-04T10:20:51"]
["x-239","Career Average","TV In (non-club)","Factors for over NPA non-Club incoming transfers - men","Male","Age last birthday at relevant date",0,239,"0-239","Table 603","Teachers' Pension Scheme: Final salary section and career average section\nOver NPA non-Club incoming transfers: Factors and guidance\nDate: 27 October 2019","2023-06-30",null,"Issued",null,"L:\\Factors\\2017\\TPS_EW\\Client output\\Tranche 2_2.4%\\CETV bespoke outputs TPS EW - A + B - C v0.11 (2.4% scape) with TVins.xlsm","Jessica","2018-12-04T11:14:54"]
["x-240","Career Average","TV In (non-club)","Factors for over NPA non-Club incoming transfers - women","Female","Age last birthday at relevant date",0,240,"0-240","Table 613","Teachers' Pension Scheme: Final salary section and career average section\nOver NPA non-Club incoming transfers: Factors and guidance\nDate: 27 October 2019","2023-06-30",null,"Issued",null,"L:\\Factors\\2017\\TPS_EW\\Client output\\Tranche 2_2.4%\\CETV bespoke outputs TPS EW - A + B - C v0.11 (2.4% scape) with TVins.xlsm","Jessica","2018-12-04T11:14:54"]
["x-301","All","Pensioner Cash Equivalent","TPS, Factors to calculate pensioner cash equivalents on divorce - retirement not on grounds of ill health","Male","Age last birthday at relevant date",0,301,"0-301","Table 303","Teachers' Pension Scheme: Final salary sections and career average section\nPensioner cash equivalents on divorce\nDate: 12 May 2021","2023-05-26",null,"Issued",null,"\\\\Gad-ast\\ast\\Factors\\2017\\TPS_EW\\Client output\\Tranche 1_2.4%\\CETV bespoke outputs TPS EW - A + B - C v0.11_SCAPE 2.4%.xlsm","Tadeos","2018-11-06T17:00:34"]
["x-302","All","Pensioner Cash Equivalent","TPS, Factors to calculate pensioner cash equivalents on divorce - retirement not on grounds of ill health","Female","Age last birthday at relevant date",0,302,"0-302","Table 313","Teachers' Pension Scheme: Final salary sections and career average section\nPensioner cash equivalents on divorce\nDate: 12 May 2021","2023-05-26",null,"Issued",null,"\\\\Gad-ast\\ast\\Factors\\2017\\TPS_EW\\Client output\\Tranche 1_2.4%\\CETV bespoke outputs TPS EW - A + B - C v0.11_SCAPE 2.4%.xlsm","Tadeos","2018-11-06T17:00:34"]
["x-303","All","Pensioner Cash Equivalent","TPS, Factors to calculate pensioner cash equivalents on divorce - retirement on grounds of ill health - ages 20 to 95","Male","Age last birthday at relevant date",0,303,"0-303","Table 323","Teachers' Pension Scheme: Final salary sections and career average section\nPensioner cash equivalents on divorce\nDate: 12 May 2021","2023-05-26",null,"Issued",null,"\\\\Gad-ast\\ast\\Factors\\2017\\TPS_EW\\Client output\\Tranche 1_2.4%\\CETV bespoke outputs TPS EW - A + B - C v0.11_SCAPE 2.4%.xlsm","Meera","2018-11-07T14:58:45"]
["x-304","All","Pensioner Cash Equivalent","TPS, Factors to calculate pensioner cash equivalents on divorce - retirement on grounds of ill health - ages 20 to 95","Female","Age last birthday at relevant date",0,304,"0-304","Table 333","Teachers' Pension Scheme: Final salary sections and career average section\nPensioner cash equivalents on divorce\nDate: 12 May 2021","2023-05-26",null,"Issued",null,"\\\\Gad-ast\\ast\\Factors\\2017\\TPS_EW\\Client output\\Tranche 1_2.4%\\CETV bespoke outputs TPS EW - A + B - C v0.11_SCAPE 2.4%.xlsm","Meera","2018-11-07T14:58:45"]
["x-305","Final Salary","Capitalisation","Factors for calculating divorce fee deduction, male, NPA 60","Male","Age last birthday at relevant date",1,305,"1-305","Table DF60M","Teachers' Pension Scheme: Final salary sections and career average section\nRecovering pensions on divorce administration charges: deduction from benefits: Factors and guidance\nDate: 8 November 2019","2023-05-26",null,"Issued",null,"L:\\Factors\\2017\\TPS_EW\\Client output\\Tranche 1_2.4%\\CETV bespoke outputs TPS EW - A + B - C v0.11_SCAPE 2.4%.xlsm","Thannima","2018-11-21T17:06:22"]
["x-306","Final Salary","Capitalisation","Factors for calculating divorce fee deduction, female, NPA 60","Female","Age last birthday at relevant date",1,306,"1-306","Table DF60F","Teachers' Pension Scheme: Final salary sections and career average section\nRecovering pensions on divorce administration charges: deduction from benefits: Factors and guidance\nDate: 8 November 2019","2023-05-26",null,"Issued",null,"L:\\Factors\\2017\\TPS_EW\\Client output\\Tranche 1_2.4%\\CETV bespoke outputs TPS EW - A + B - C v0.11_SCAPE 2.4%.xlsm","Thannima","2018-11-21T17:06:22"]
["x-307","All","Capitalisation","Factors for calculating divorce fee deduction, male, NPA 65","Male","Age last birthday at relevant date",0,307,"0-307","Table DF65M","Teachers' Pension Scheme: Final salary sections and career average section\nRecovering pensions on divorce administration charges: deduction from benefits: Factors and guidance\nDate: 8 November 2019","2023-05-26",null,"Issued",null,"L:\\Factors\\2017\\TPS_EW\\Client output\\Tranche 1_2.4%\\CETV bespoke outputs TPS EW - A + B - C v0.11_SCAPE 2.4%.xlsm","Thannima","2018-11-21T17:06:22"]
["x-308","All","Capitalisation","Factors for calculating divorce fee deduction, female, NPA 65","Female","Age last birthday at relevant date",0,308,"0-308","Table DF65F","Teachers' Pension Scheme: Final salary sections and career average section\nRecovering pensions on divorce administration charges: deduction from benefits: Factors and guidance\nDate: 8 November 2019","2023-05-26",null,"Issued",null,"L:\\Factors\\2017\\TPS_EW\\Client output\\Tranche 1_2.4%\\CETV bespoke outputs TPS EW - A + B - C v0.11_SCAPE 2.4%.xlsm","Thannima","2018-11-21T17:06:22"]
["x-309","Career Average","Capitalisation","Factors for calculating divorce fee deduction, male, NPA 66","Male","Age last birthday at relevant date",0,309,"0-309","Table DF66M","Teachers' Pension Scheme: Final salary sections and career average section\nRecovering pensions on divorce administration charges: deduction from benefits: Factors and guidance\nDate: 8 November 2019","2023-05-26",null,"Issued",null,"L:\\Factors\\2017\\TPS_EW\\Client output\\Tranche 1_2.4%\\CETV bespoke outputs TPS EW - A + B - C v0.11_SCAPE 2.4%.xlsm","Thannima","2018-11-21T17:06:22"]
["x-310","Career Average","Capitalisation","Factors for calculating divorce fee deduction, female, NPA 66","Female","Age last birthday at relevant date",0,310,"0-310","Table DF66F","Teachers' Pension Scheme: Final salary sections and career average section\nRecovering pensions on divorce administration charges: deduction from benefits: Factors and guidance\nDate: 8 November 2019","2023-05-26",null,"Issued",null,"L:\\Factors\\2017\\TPS_EW\\Client output\\Tranche 1_2.4%\\CETV bespoke outputs TPS EW - A + B - C v0.11_SCAPE 2.4%.xlsm","Thannima","2018-11-21T17:06:22"]
["x-311","Career Average","Capitalisation","Factors for calculating divorce fee deduction, male, NPA 67","Male","Age last birthday at relevant date",0,311,"0-311","Table DF67M","Teachers' Pension Scheme: Final salary sections and career average section\nRecovering pensions on divorce administration charges: deduction from benefits: Factors and guidance\nDate: 8 November 2019","2023-05-26",null,"Issued",null,"L:\\Factors\\2017\\TPS_EW\\Client output\\Tranche 1_2.4%\\CETV bespoke outputs TPS EW - A + B - C v0.11_SCAPE 2.4%.xlsm","Thannima","2018-11-21T17:06:22"]
["x-312","Career Average","Capitalisation","Factors for calculating divorce fee deduction, female, NPA 67","Female","Age last birthday at relevant date",0,312,"0-312","Table DF67F","Teachers' Pension Scheme: Final salary sections and career average section\nRecovering pensions on divorce administration charges: deduction from benefits: Factors and guidance\nDate: 8 November 2019","2023-05-26",null,"Issued",null,"L:\\Factors\\2017\\TPS_EW\\Client output\\Tranche 1_2.4%\\CETV bespoke outputs TPS EW - A + B - C v0.11_SCAPE 2.4%.xlsm","Thannima","2018-11-21T17:06:22"]
["x-313","Career Average","Capitalisation","Factors for calculating divorce fee deduction, male, NPA 68","Male","Age last birthday at relevant date",0,313,"0-313","Table DF68M","Teachers' Pension Scheme: Final salary sections and career average section\nRecovering pensions on divorce administration charges: deduction from benefits: Factors and guidance\nDate: 8 November 2019","2023-05-26",null,"Issued",null,"L:\\Factors\\2017\\TPS_EW\\Client output\\Tranche 1_2.4%\\CETV bespoke outputs TPS EW - A + B - C v0.11_SCAPE 2.4%.xlsm","Thannima","2018-11-21T17:06:22"]
["x-314","Career Average","Capitalisation","Factors for calculating divorce fee deduction, female, NPA 68","Female","Age last birthday at relevant date",0,314,"0-314","Table DF68F","Teachers' Pension Scheme: Final salary sections and career average section\nRecovering pensions on divorce administration charges: deduction from benefits: Factors and guidance\nDate: 8 November 2019","2023-05-26",null,"Issued",null,"L:\\Factors\\2017\\TPS_EW\\Client output\\Tranche 1_2.4%\\CETV bespoke outputs TPS EW - A + B - C v0.11_SCAPE 2.4%.xlsm","Thannima","2018-11-21T17:06:22"]
["x-315","Final Salary","Pension Credit","Factors for calculating divorce pension credits for male ex-spouses, NPA 60","Male","Age last birthday at relevant date",1,315,"1-315","Table 403","Teachers' Pension Scheme: Final salary section and career average section\nPension credits on divorce: Factors and guidance\nDate: 27 October 2019","2023-05-26",null,"Issued",null,"\\\\Gad-ast\\ast\\Factors\\2017\\TPS_EW\\Client output\\Tranche 1_2.4%\\CETV bespoke outputs TPS EW - A + B - C v0.11_SCAPE 2.4%.xlsm","Meera","2018-11-28T15:55:07"]
["x-316","Final Salary","Pension Credit","Factors for calculating divorce pension credits for female ex-spouses, NPA 60","Female","Age last birthday at relevant date",1,316,"1-316","Table 413","Teachers' Pension Scheme: Final salary section and career average section\nPension credits on divorce: Factors and guidance\nDate: 27 October 2019","2023-05-26",null,"Issued",null,"\\\\Gad-ast\\ast\\Factors\\2017\\TPS_EW\\Client output\\Tranche 1_2.4%\\CETV bespoke outputs TPS EW - A + B - C v0.11_SCAPE 2.4%.xlsm","Meera","2018-11-28T15:55:07"]
["x-317","All","Pension Credit","Factors for calculating divorce pension credits for male ex-spouses, NPA 65","Male","Age last birthday at relevant date",0,317,"0-317","Table 423","Teachers' Pension Scheme: Final salary section and career average section\nPension credits on divorce: Factors and guidance\nDate: 27 October 2019","2023-05-26",null,"Issued",null,"\\\\Gad-ast\\ast\\Factors\\2017\\TPS_EW\\Client output\\Tranche 1_2.4%\\CETV bespoke outputs TPS EW - A + B - C v0.11_SCAPE 2.4%.xlsm","Meera","2018-11-28T15:55:07"]
["x-318","All","Pension Credit","Factors for calculating divorce pension credits for female ex-spouses, NPA 65","Female","Age last birthday at relevant date",0,318,"0-318","Table 433","Teachers' Pension Scheme: Final salary section and career average section\nPension credits on divorce: Factors and guidance\nDate: 27 October 2019","2023-05-26",null,"Issued",null,"\\\\Gad-ast\\ast\\Factors\\2017\\TPS_EW\\Client output\\Tranche 1_2.4%\\CETV bespoke outputs TPS EW - A + B - C v0.11_SCAPE 2.4%.xlsm","Meera","2018-11-28T15:55:07"]
["x-319","Career Average","Pension Credit","Factors for calculating divorce pension credits for male ex-spouses, NPA 66","Male","Age last birthday at relevant date",0,319,"0-319","Table 443","Teachers' Pension Scheme: Final salary section and career average section\nPension credits on divorce: Factors and guidance\nDate: 27 October 2019","2023-05-26",null,"Issued",null,"\\\\Gad-ast\\ast\\Factors\\2017\\TPS_EW\\Client output\\Tranche 1_2.4%\\CETV bespoke outputs TPS EW - A + B - C v0.11_SCAPE 2.4%.xlsm","Meera","2018-11-28T15:55:07"]
["x-320","Career Average","Pension Credit","Factors for calculating divorce pension credits for female ex-spouses, NPA 66","Female","Age last birthday at relevant date",0,320,"0-320","Table 453","Teachers' Pension Scheme: Final salary section and career average section\nPension credits on divorce: Factors and guidance\nDate: 27 October 2019","2023-05-26",null,"Issued",null,"\\\\Gad-ast\\ast\\Factors\\2017\\TPS_EW\\Client output\\Tranche 1_2.4%\\CETV bespoke outputs TPS EW - A + B - C v0.11_SCAPE 2.4%.xlsm","Meera","2018-11-28T15:55:07"]
["x-321","Career Average","Pension Credit","Factors for calculating divorce pension credits for male ex-spouses, NPA 67","Male","Age last birthday at relevant date",0,321,"0-321","Table 463","Teachers' Pension Scheme: Final salary section and career average section\nPension credits on divorce: Factors and guidance\nDate: 27 October 2019","2023-05-26",null,"Issued",null,"\\\\Gad-ast\\ast\\Factors\\2017\\TPS_EW\\Client output\\Tranche 1_2.4%\\CETV bespoke outputs TPS EW - A + B - C v0.11_SCAPE 2.4%.xlsm","Meera","2018-11-28T15:55:07"]
["x-322","Career Average","Pension Credit","Factors for calculating divorce pension credits for female ex-spouses, NPA 67","Female","Age last birthday at relevant date",0,322,"0-322","Table 473","Teachers' Pension Scheme: Final salary section and career average section\nPension credits on divorce: Factors and guidance\nDate: 27 October 2019","2023-05-26",null,"Issued",null,"\\\\Gad-ast\\ast\\Factors\\2017\\TPS_EW\\Client output\\Tranche 1_2.4%\\CETV bespoke outputs TPS EW - A + B - C v0.11_SCAPE 2.4%.xlsm","Meera","2018-11-28T15:55:07"]
["x-323","Career Average","Pension Credit","Factors for calculating divorce pension credits for male ex-spouses, NPA 68","Male","Age last birthday at relevant date",0,323,"0-323","Table 483","Teachers' Pension Scheme: Final salary section and career average section\nPension credits on divorce: Factors and guidance\nDate: 27 October 2019","2023-05-26",null,"Issued",null,"\\\\Gad-ast\\ast\\Factors\\2017\\TPS_EW\\Client output\\Tranche 1_2.4%\\CETV bespoke outputs TPS EW - A + B - C v0.11_SCAPE 2.4%.xlsm","Meera","2018-11-28T15:55:07"]
[{"$f":"HYPERLINK(\"#'x-\"&H67 & \"'!A1\",\"x-\"&H67)","v":"x-324"},"Career Average","Pension Credit","Factors for calculating divorce pension credits for female ex-spouses, NPA 68","Female","Age last birthday at relevant date",0,324,"0-324","Table 493","Teachers' Pension Scheme: Final salary section and career average section\nPension credits on divorce: Factors and guidance\nDate: 27 October 2019","2023-05-26",null,"Issued",null,"\\\\Gad-ast\\ast\\Factors\\2017\\TPS_EW\\Client output\\Tranche 1_2.4%\\CETV bespoke outputs TPS EW - A + B - C v0.11_SCAPE 2.4%.xlsm","Meera","2018-11-28T15:55:07"]
["x-401","Final Salary","ERF","Benefits payable to the member on early retirement (with actuarial reduction) - final salary section, NPA 60 members, main scheme pension and lump sum","Unisex","Age/Completed months",1,401,"1-401","ER1","Teachers' Pension Scheme: Final salary sections and career average section\nEarly retirements in normal health: Factors and guidance\nDate: 24 June 2019","2023-06-30",null,"Issued",null,"L:\\Factors\\2017\\TPS_EW\\Client output\\Tranche 1_2.4%\\CETV bespoke outputs TPS EW - A + B - C v0.11_SCAPE 2.4%.xlsm","Meera","2018-11-16T11:45:38"]
["x-402","Final Salary","ERF","Benefits payable to the member on early retirement (with actuarial reduction) - final salary section, NPA 60 members, additional pension, contract exercised on or before 22 June 2010","Unisex","Age/Completed months",1,402,"1-402","ER2","Teachers' Pension Scheme: Final salary sections and career average section\nEarly retirements in normal health: Factors and guidance\nDate: 24 June 2019","2023-06-30",null,"Issued",null,"L:\\Factors\\2017\\TPS_EW\\Client output\\Tranche 1_2.4%\\CETV bespoke outputs TPS EW - A + B - C v0.11_SCAPE 2.4%.xlsm","Meera","2018-11-16T11:45:38"]
["x-403","Final Salary","ERF","Benefits payable to the member on early retirement (with actuarial reduction) - NPA 60 members, additional pension, contract exercised after 22 June 2010","Unisex","Age/Completed months",1,403,"1-403","ER3","Teachers' Pension Scheme: Final salary sections and career average section\nEarly retirements in normal health: Factors and guidance\nDate: 24 June 2019","2023-06-30",null,"Issued",null,"L:\\Factors\\2017\\TPS_EW\\Client output\\Tranche 1_2.4%\\CETV bespoke outputs TPS EW - A + B - C v0.11_SCAPE 2.4%.xlsm","Meera","2018-11-16T11:45:38"]
["x-404","Final Salary","ERF","Benefits payable to the member on early retirement (with actuarial reduction) - final salary section, NPA 65 members, main scheme pension","Unisex","Age/Completed months",1,404,"1-404","ER4","Teachers' Pension Scheme: Final salary sections and career average section\nEarly retirements in normal health: Factors and guidance\nDate: 24 June 2019","2023-06-30",null,"Issued",null,"L:\\Factors\\2017\\TPS_EW\\Client output\\Tranche 1_2.4%\\CETV bespoke outputs TPS EW - A + B - C v0.11_SCAPE 2.4%.xlsm","Meera","2018-11-16T11:45:38"]
["x-405","Final Salary","ERF","Benefits payable to the member on early retirement (with actuarial reduction)  - Final Salary section, NPA 65 members, additional pension, contract exercised on or before 22 June 2010","Unisex","Age/Completed months",1,405,"1-405","ER5","Teachers' Pension Scheme: Final salary sections and career average section\nEarly retirements in normal health: Factors and guidance\nDate: 24 June 2019","2023-06-30",null,"Issued",null,"L:\\Factors\\2017\\TPS_EW\\Client output\\Tranche 1_2.4%\\CETV bespoke outputs TPS EW - A + B - C v0.11_SCAPE 2.4%.xlsm","Meera","2018-11-16T11:45:38"]
["x-406","Final Salary","ERF","Benefits payable to the member on early retirement (with actuarial reduction)  - Final Salary Section, NPA 65 members, Additional pension, contract exercised after 22 June 2010","Unisex","Age/Completed months",1,406,"1-406","ER6","Teachers' Pension Scheme: Final salary sections and career average section\nEarly retirements in normal health: Factors and guidance\nDate: 24 June 2019","2023-06-30",null,"Issued",null,"L:\\Factors\\2017\\TPS_EW\\Client output\\Tranche 1_2.4%\\CETV bespoke outputs TPS EW - A + B - C v0.11_SCAPE 2.4%.xlsm","Meera","2018-11-16T11:45:38"]
["x-407","Career Average","ERF","Benefits payable to the member on early retirement (with actuarial reduction) - Career Average Section, Active members, All NPAs, full retirement earned pension","Unisex","Age/Completed months",0,407,"0-407","ER7","Teachers' Pension Scheme: Final salary sections and career average section\nEarly retirements in normal health: Factors and guidance\nDate: 24 June 2019","2023-06-30",null,"Issued",null,"L:\\Factors\\2017\\TPS_EW\\Client output\\Tranche 1_2.4%\\CETV bespoke outputs TPS EW - A + B - C v0.11_SCAPE 2.4%.xlsm","Meera","2018-11-16T11:45:38"]
["x-408","Career Average","ERF","Benefits payable to the member on early retirement (with actuarial reduction) - (1) Career average section, deferred members, all NPAs, full retirement earned pension (2) career average section, active and deferred members, all NPAs, additional pension and pension debits (3) career average section, pension credit members, all NPAs.","Unisex","Period to NPA",0,408,"0-408","ER8","Teachers' Pension Scheme: Final salary sections and career average section\nEarly retirements in normal health: Factors and guidance\nDate: 24 June 2019","2023-06-30",null,"Issued",null,"L:\\Factors\\2017\\TPS_EW\\Client output\\Tranche 1_2.4%\\CETV bespoke outputs TPS EW - A + B - C v0.11_SCAPE 2.4%.xlsm","Meera","2018-11-16T11:45:38"]
["x-409","Career Average","ERF","Benefits payable to the member on early retirement (with actuarial reduction)  - Career Average Section, deferred members, all NPAs, full retirement earned pension subject to buy out election","Unisex","Age/Completed months",0,409,"0-409","ER9","Teachers' Pension Scheme: Final salary sections and career average section\nEarly retirements in normal health: Factors and guidance\nDate: 24 June 2019","2023-06-30",null,"Issued",null,"L:\\Factors\\2017\\TPS_EW\\Client output\\Tranche 1_2.4%\\CETV bespoke outputs TPS EW - A + B - C v0.11_SCAPE 2.4%.xlsm","Meera","2018-11-16T11:45:38"]
["x-410","Final Salary","LRF","Benefits payable to the member on late retirement (with actuarial uplift) - final salary section, NPA 65 members, main scheme pension","Unisex","Age/Completed months",1,410,"1-410","LR1","Teachers' Pension Scheme: Final salary section\nLate retirements: Factors and guidance\nDate: 24 June 2019","2023-06-30",null,"Issued",null,"L:\\Factors\\2017\\TPS_EW\\Client output\\Tranche 1_2.4%\\CETV bespoke outputs TPS EW - A + B - C v0.11_SCAPE 2.4%.xlsm","Meera","2018-11-16T11:45:38"]
["x-411","Final Salary","LRF","Benefits payable to the member on late retirement (with actuarial uplift) - Final Salary Section, NPA 65 members, pension debits","Unisex","Age/Completed months",1,411,"1-411","LR2","Teachers' Pension Scheme: Final salary section\nLate retirements: Factors and guidance\nDate: 24 June 2019","2023-06-30",null,"Issued",null,"L:\\Factors\\2017\\TPS_EW\\Client output\\Tranche 1_2.4%\\CETV bespoke outputs TPS EW - A + B - C v0.11_SCAPE 2.4%.xlsm","Meera","2018-11-16T11:45:38"]
["x-412","Final Salary","LRF","Benefits payable to the member on late retirement (with actuarial uplift) - final salary section, NPA 60 members, annual allowance pension and lump sum debits","Unisex","Age/Completed months",1,412,"1-412","LR3","Teachers' Pension Scheme: Final salary section\nLate retirements: Factors and guidance\nDate: 24 June 2019","2023-06-30",null,"Issued",null,"L:\\Factors\\2017\\TPS_EW\\Client output\\Tranche 1_2.4%\\CETV bespoke outputs TPS EW - A + B - C v0.11_SCAPE 2.4%.xlsm","Meera","2018-11-16T11:45:38"]
["x-413","Career Average","LRF","Benefits payable to the member on late retirement (with actuarial uplift) - Career Average Section, active members, all NPAs, full retirement earned pension","Unisex","Years/Completed months",0,413,"1-413","CLR1","Teachers' Pension Scheme: Career Average section\nLate retirements: Factors and guidance\nDate: 10 February 2020","2023-06-30",null,"Issued"]
["x-414","Career Average","LRF","Benefits payable to the member on late retirement (with actuarial uplift) - Career average section, active members, all NPAs, pension sharing debits and annual allowance debits","Unisex","Years/Completed months",0,414,"1-414","CLR2","Teachers' Pension Scheme: Career Average section\nLate retirements: Factors and guidance\nDate: 10 February 2020","2023-06-30",null,"Issued"]
["x-501","All","Trivial Commutation","Trivial commutation factors for former contributing members","Unisex","Age last birthday",0,501,"0-501","Table A1","Teachers' Pension Scheme: Final salary sections and career average section\nTrivial commutation: Factors and guidance\nDate: 24 June 2019","2023-07-28",null,"Issued",null,"\\\\Gad-ast\\ast\\Factors\\2017\\TPS_EW\\Client output\\Tranche 1_2.4%\\CETV bespoke outputs TPS EW - A + B - C v0.11_SCAPE 2.4%.xlsm","Meera","2018-11-28T15:55:07"]
["x-502","All","Trivial Commutation","Trivial commutation factors for surviving dependants","Unisex","Age last birthday",0,502,"0-502","Table A2","Teachers' Pension Scheme: Final salary sections and career average section\nTrivial commutation: Factors and guidance\nDate: 24 June 2019","2023-07-28",null,"Issued",null,"\\\\Gad-ast\\ast\\Factors\\2017\\TPS_EW\\Client output\\Tranche 1_2.4%\\CETV bespoke outputs TPS EW - A + B - C v0.11_SCAPE 2.4%.xlsm","Meera","2018-11-28T15:55:07"]
["x-503","All","Trivial Commutation","Trivial commutation factors for pension credit members","Unisex","Age last birthday",0,503,"0-503","Table A3","Teachers' Pension Scheme: Final salary sections and career average section\nTrivial commutation: Factors and guidance\nDate: 24 June 2019","2023-07-28",null,"Issued",null,"\\\\Gad-ast\\ast\\Factors\\2017\\TPS_EW\\Client output\\Tranche 1_2.4%\\CETV bespoke outputs TPS EW - A + B - C v0.11_SCAPE 2.4%.xlsm","Meera","2018-11-28T15:55:07"]
["x-504","All","Inverse Commutation","Conversion factors for members over age 75","Unisex","Age last birthday",0,504,"0-504","Table A1","Teachers' Pension Scheme: Final salary sections and career average section\nConversion of lump sum to pension: Factors and guidance\nDate: 24 June 2019","2023-07-28",null,"Issued",null,"\\\\Gad-ast\\ast\\Factors\\2017\\TPS_EW\\Client output\\Tranche 1_2.4%\\CETV bespoke outputs TPS EW - A + B - C v0.11_SCAPE 2.4%.xlsm","Meera","2018-11-28T15:55:07"]
["x-505","All","Inverse Commutation","Lump sum conversion factors in lieu of repayment of contributions or any retirement lump sum above the permitted maximum","Unisex","Age last birthday",0,505,"0-505","Table A2","Teachers' Pension Scheme: Final salary sections and career average section\nConversion of lump sum to pension: Factors and guidance\nDate: 24 June 2019","2023-07-28",null,"Issued",null,"\\\\Gad-ast\\ast\\Factors\\2017\\TPS_EW\\Client output\\Tranche 1_2.4%\\CETV bespoke outputs TPS EW - A + B - C v0.11_SCAPE 2.4%.xlsm","Meera","2018-11-28T15:55:07"]
["x-601","Final Salary","Scheme pays AA","Factors for calculating annual allowance debit - NPA 60","Unisex","Age last birthday at relevant date",1,601,"1-601","Table 801","Teachers' Pension Scheme: Final salary section\nAnnual allowance tax charge debits: Factors and guidance\nDate: 11 September 2019","2023-07-28",null,"Issued",null,"L:\\Factors\\2017\\TPS_EW\\Client output\\Tranche 1_2.4%\\CETV bespoke outputs TPS EW - A + B - C v0.13_SCAPE 2.4%.xlsm","aidanm","2019-01-11T12:20:38"]
["x-602","Final Salary","Scheme pays AA","Factors for calculating annual allowance debit - NPA 65","Unisex","Age last birthday at relevant date",1,602,"1-602","Table 811","Teachers' Pension Scheme: Final salary section\nAnnual allowance tax charge debits: Factors and guidance\nDate: 11 September 2019","2023-07-28",null,"Issued",null,"L:\\Factors\\2017\\TPS_EW\\Client output\\Tranche 1_2.4%\\CETV bespoke outputs TPS EW - A + B - C v0.13_SCAPE 2.4%.xlsm","aidanm","2019-01-11T12:20:38"]
["x-603","Final Salary","Scheme pays AA","Timing adjustment on ill health retirements - NPA 60","Unisex","Age (years/completed months)",1,603,"1-603","Table 841","Teachers' Pension Scheme: Final salary section\nAnnual allowance tax charge debits: Factors and guidance\nDate: 11 September 2019","2023-07-28",null,"Issued",null,"L:\\Factors\\2017\\TPS_EW\\Client output\\Tranche 1_2.4%\\CETV bespoke outputs TPS EW - A + B - C v0.13_SCAPE 2.4%.xlsm","aidanm","2019-01-11T12:20:38"]
["x-604","Final Salary","Scheme pays AA","Timing adjustment on ill health retirements - NPA 65","Unisex","Age (years/completed months)",1,604,"1-604","Table 851","Teachers' Pension Scheme: Final salary section\nAnnual allowance tax charge debits: Factors and guidance\nDate: 11 September 2019","2023-07-28",null,"Issued",null,"L:\\Factors\\2017\\TPS_EW\\Client output\\Tranche 1_2.4%\\CETV bespoke outputs TPS EW - A + B - C v0.13_SCAPE 2.4%.xlsm","aidanm","2019-01-11T12:20:38"]
["x-605","Career Average","Scheme pays AA","Factors for calculating annual allowance debit - NPA 65","Unisex","Age last birthday at relevant date",0,605,"0-605","Table CSP65a","Teachers' Pension Scheme: Career average section\nAnnual allowance tax charge debits: Factors and guidance\nDate: 11 September 2019","2023-07-28",null,"Issued",null,"L:\\Factors\\2017\\TPS_EW\\Client output\\Tranche 1_2.4%\\CETV bespoke outputs TPS EW - A + B - C v0.13_SCAPE 2.4%.xlsm","aidanm","2019-01-11T12:20:38"]
["x-606","Career Average","Scheme pays AA","Factors for calculating annual allowance debit - NPA 66","Unisex","Age last birthday at relevant date",0,606,"0-606","Table CSP66a","Teachers' Pension Scheme: Career average section\nAnnual allowance tax charge debits: Factors and guidance\nDate: 11 September 2019","2023-07-28",null,"Issued",null,"L:\\Factors\\2017\\TPS_EW\\Client output\\Tranche 1_2.4%\\CETV bespoke outputs TPS EW - A + B - C v0.13_SCAPE 2.4%.xlsm","aidanm","2019-01-11T12:20:38"]
["x-607","Career Average","Scheme pays AA","Factors for calculating annual allowance debit - NPA 67","Unisex","Age last birthday at relevant date",0,607,"0-607","Table CSP67a","Teachers' Pension Scheme: Career average section\nAnnual allowance tax charge debits: Factors and guidance\nDate: 11 September 2019","2023-07-28",null,"Issued",null,"L:\\Factors\\2017\\TPS_EW\\Client output\\Tranche 1_2.4%\\CETV bespoke outputs TPS EW - A + B - C v0.13_SCAPE 2.4%.xlsm","aidanm","2019-01-11T12:20:38"]
["x-608","Career Average","Scheme pays AA","Factors for calculating annual allowance debit - NPA 68","Unisex","Age last birthday at relevant date",0,608,"0-608","Table CSP68a","Teachers' Pension Scheme: Career average section\nAnnual allowance tax charge debits: Factors and guidance\nDate: 11 September 2019","2023-07-28",null,"Issued",null,"L:\\Factors\\2017\\TPS_EW\\Client output\\Tranche 1_2.4%\\CETV bespoke outputs TPS EW - A + B - C v0.13_SCAPE 2.4%.xlsm","aidanm","2019-01-11T12:20:38"]
["x-609","Career Average","Scheme pays AA","Timing adjustments on ill health retirements - All NPAs","Unisex","Period to NPA (years/months) - part months rounded up to the nearest month",0,609,"0-609","Table TA1a","Teachers' Pension Scheme: Career average section\nAnnual allowance tax charge debits: Factors and guidance\nDate: 11 September 2019","2023-07-28",null,"Issued",null,"L:\\Factors\\2017\\TPS_EW\\Client output\\Tranche 1_2.4%\\CETV bespoke outputs TPS EW - A + B - C v0.13_SCAPE 2.4%.xlsm","aidanm","2019-01-11T12:20:38"]
["x-610","All","Scheme pays LTA","Factors to calculate debit to pension for LTA tax charges for retirements not on grounds of ill health","Unisex","Age last birthday at relevant date",0,610,"0-610","Table LTA_NH1","Teachers' Pension Scheme: Final salary and career average sections\nLifetime Allowance tax charge debits: Factors and guidance\nDate: 11 September 2019","2023-07-28",null,"Issued",null,"L:\\Factors\\2017\\TPS_EW\\Client output\\Tranche 1_2.4%\\CETV bespoke outputs TPS EW - A + B - C v0.13_SCAPE 2.4%.xlsm","aidanm","2019-01-11T12:20:38"]
["x-611","All","Scheme pays LTA","Factors to calculate debit to pension for LTA tax charges for retirements on grounds of ill health","Unisex","Age last birthday at relevant date",0,611,"0-611","Table LTA_IH1","Teachers' Pension Scheme: Final salary and career average sections\nLifetime Allowance tax charge debits: Factors and guidance\nDate: 11 September 2019","2023-07-28",null,"Issued",null,"L:\\Factors\\2017\\TPS_EW\\Client output\\Tranche 1_2.4%\\CETV bespoke outputs TPS EW - A + B - C v0.13_SCAPE 2.4%.xlsm","aidanm","2019-01-11T12:20:38"]
["x-702","All","Added pension","Lump sum elections - Single premium per £250 AP at date of election, £. - NPA 65 (New Election)","Unisex","Age when notice of election given",0,702,"0-702","Table S65","Teachers' Pension Scheme: Final salary sections and career average section\nPurchase of additional pension and ceasing monthly contribution elections: Factors and guidance\nDate: 24 June 2019","2023-10-17",null,"Issued",null,"H:\\Factors\\2017\\TPS_EW\\Client output\\Tranche 2_2.4%\\CETV bespoke outputs TPS EW - A + B - C v0.13 (2.4% scape).xlsm","Tadeos","2019-01-04T16:01:51"]
["x-703","Career Average","Added pension","Lump sum elections - Single premium per £250 AP at date of election, £. - NPA 66 (New Election)","Unisex","Age when notice of election given",0,703,"0-703","Table S66","Teachers' Pension Scheme: Final salary sections and career average section\nPurchase of additional pension and ceasing monthly contribution elections: Factors and guidance\nDate: 24 June 2019","2023-10-17",null,"Issued",null,"H:\\Factors\\2017\\TPS_EW\\Client output\\Tranche 2_2.4%\\CETV bespoke outputs TPS EW - A + B - C v0.13 (2.4% scape).xlsm","Tadeos","2019-01-04T16:01:51"]
[{"$f":"HYPERLINK(\"#'x-\"&H100 & \"'!A1\",\"x-\"&H100)","v":"x-704"},"Career Average","Added pension","Lump sum elections - Single premium per £250 AP at date of election, £. - NPA 67 (New Election)","Unisex","Age when notice of election given",0,704,"0-704","Table S67","Teachers' Pension Scheme: Final salary sections and career average section\nPurchase of additional pension and ceasing monthly contribution elections: Factors and guidance\nDate: 24 June 2019","2023-10-17",null,"Issued",null,"H:\\Factors\\2017\\TPS_EW\\Client output\\Tranche 2_2.4%\\CETV bespoke outputs TPS EW - A + B - C v0.13 (2.4% scape).xlsm","Tadeos","2019-01-04T16:01:51"]
["x-705","Career Average","Added pension","Lump sum elections - Single premium per £250 AP at date of election, £. - NPA 68 (New Election)","Unisex","Age when notice of election given",0,705,"0-705","Table S68","Teachers' Pension Scheme: Final salary sections and career average section\nPurchase of additional pension and ceasing monthly contribution elections: Factors and guidance\nDate: 24 June 2019","2023-10-17",null,"Issued",null,"H:\\Factors\\2017\\TPS_EW\\Client output\\Tranche 2_2.4%\\CETV bespoke outputs TPS EW - A + B - C v0.13 (2.4% scape).xlsm","Tadeos","2019-01-04T16:01:51"]
["x-706","Final Salary","Added pension","Personal benefits, NPA 60. (Regular contribution elections made after 22 June 2010). Monthly contribution per £250 AP at date of election, £","Unisex","Age when notice of election given/ Payment period (in years)",1,706,"1-706","Table C60","Teachers' Pension Scheme: Final salary sections and career average section\nPurchase of additional pension and ceasing monthly contribution elections: Factors and guidance\nDate: 24 June 2019","2023-10-17",null,"Issued",null,"H:\\Factors\\2017\\TPS_EW\\Client output\\Tranche 2_2.4%\\CETV bespoke outputs TPS EW - A + B - C v0.13 (2.4% scape).xlsm","Tadeos","2019-01-04T16:01:51"]
["x-707","Final Salary","Added pension","Personal and dependant's benefits, NPA 60. (Regular contribution elections made after 22 June 2010). Monthly contribution per £250 AP at date of election, £","Unisex","Age when notice of election given/ Payment period (in years)",1,707,"1-707","Table C60D","Teachers' Pension Scheme: Final salary sections and career average section\nPurchase of additional pension and ceasing monthly contribution elections: Factors and guidance\nDate: 24 June 2019","2023-10-17",null,"Issued",null,"H:\\Factors\\2017\\TPS_EW\\Client output\\Tranche 2_2.4%\\CETV bespoke outputs TPS EW - A + B - C v0.13 (2.4% scape).xlsm","Tadeos","2019-01-04T16:01:51"]
["x-708","All","Added pension","Personal benefits, NPA 65. (Regular contribution elections made after 22 June 2010). Monthly contribution per £250 AP at date of election, £","Unisex","Age when notice of election given/ Payment period (in years)",0,708,"0-708","Table C65","Teachers' Pension Scheme: Final salary sections and career average section\nPurchase of additional pension and ceasing monthly contribution elections: Factors and guidance\nDate: 24 June 2019","2023-10-17",null,"Issued",null,"L:\\Factors\\2017\\TPS_EW\\Client output\\Tranche 2_2.4%\\CETV bespoke outputs TPS EW - A + B - C v0.15 (2.4% scape).xlsm","Thannima","2019-01-31T11:21:37"]
["x-709","All","Added pension","Personal and dependant's benefits, NPA 65. (Regular contribution elections made after 22 June 2010). Monthly contribution per £250 AP at date of election, £","Unisex","Age when notice of election given/ Payment period (in years)",0,709,"0-709","Table C65D","Teachers' Pension Scheme: Final salary sections and career average section\nPurchase of additional pension and ceasing monthly contribution elections: Factors and guidance\nDate: 24 June 2019","2023-10-17",null,"Issued",null,"L:\\Factors\\2017\\TPS_EW\\Client output\\Tranche 2_2.4%\\CETV bespoke outputs TPS EW - A + B - C v0.15 (2.4% scape).xlsm","Thannima","2019-01-31T11:21:37"]
["x-710","Career Average","Added pension","Personal benefits, NPA 66. (Regular contribution elections made after 22 June 2010) Monthly contribution per £250 AP at date of election, £","Unisex","Age when notice of election given/ Payment period (in years)",0,710,"0-710","Table C66","Teachers' Pension Scheme: Final salary sections and career average section\nPurchase of additional pension and ceasing monthly contribution elections: Factors and guidance\nDate: 24 June 2019","2023-10-17",null,"Issued",null,"L:\\Factors\\2017\\TPS_EW\\Client output\\Tranche 2_2.4%\\CETV bespoke outputs TPS EW - A + B - C v0.15 (2.4% scape).xlsm","Thannima","2019-01-31T11:21:37"]
["x-711","Career Average","Added pension","Personal and dependant's benefits, NPA 66. (Regular contribution elections made after 22 June 2010) Monthly contribution per £250 AP at date of election, £","Unisex","Age when notice of election given/ Payment period (in years)",0,711,"0-711","Table C66D","Teachers' Pension Scheme: Final salary sections and career average section\nPurchase of additional pension and ceasing monthly contribution elections: Factors and guidance\nDate: 24 June 2019","2023-10-17",null,"Issued",null,"L:\\Factors\\2017\\TPS_EW\\Client output\\Tranche 2_2.4%\\CETV bespoke outputs TPS EW - A + B - C v0.15 (2.4% scape).xlsm","Thannima","2019-01-31T11:21:37"]
["x-712","Career Average","Added pension","Personal benefits, NPA 67. (Regular contribution elections made after 22 June 2010) Monthly contribution per £250 AP at date of election, £","Unisex","Age when notice of election given/ Payment period (in years)",0,712,"0-712","Table C67","Teachers' Pension Scheme: Final salary sections and career average section\nPurchase of additional pension and ceasing monthly contribution elections: Factors and guidance\nDate: 24 June 2019","2023-10-17",null,"Issued",null,"L:\\Factors\\2017\\TPS_EW\\Client output\\Tranche 2_2.4%\\CETV bespoke outputs TPS EW - A + B - C v0.15 (2.4% scape).xlsm","Thannima","2019-01-31T11:21:37"]
["x-713","Career Average","Added pension","Personal and dependant's benefits, NPA 67. (Regular contribution elections made after 22 June 2010) Monthly contribution per £250 AP at date of election, £","Unisex","Age when notice of election given/ Payment period (in years)",0,713,"0-713","Table C67D","Teachers' Pension Scheme: Final salary sections and career average section\nPurchase of additional pension and ceasing monthly contribution elections: Factors and guidance\nDate: 24 June 2019","2023-10-17",null,"Issued",null,"H:\\Factors\\2017\\TPS_EW\\Client output\\Tranche 2_2.4%\\CETV bespoke outputs TPS EW - A + B - C v0.13 (2.4% scape).xlsm","Tadeos","2019-01-04T16:01:51"]
["x-714","Career Average","Added pension","Personal benefits, NPA 68. (Regular contribution elections made after 22 June 2010) Monthly contribution per £250 AP at date of election, £","Unisex","Age when notice of election given/ Payment period (in years)",0,714,"0-714","Table C68","Teachers' Pension Scheme: Final salary sections and career average section\nPurchase of additional pension and ceasing monthly contribution elections: Factors and guidance\nDate: 24 June 2019","2023-10-17",null,"Issued",null,"L:\\Factors\\2017\\TPS_EW\\Client output\\Tranche 2_2.4%\\CETV bespoke outputs TPS EW - A + B - C v0.15 (2.4% scape).xlsm","Thannima","2019-01-31T11:21:37"]
["x-715","Career Average","Added pension","Personal and dependant's benefits, NPA 68. (Regular contribution elections made after 22 June 2010) Monthly contribution per £250 AP at date of election, £","Unisex","Age when notice of election given/ Payment period (in years)",0,715,"0-715","Table C68D","Teachers' Pension Scheme: Final salary sections and career average section\nPurchase of additional pension and ceasing monthly contribution elections: Factors and guidance\nDate: 24 June 2019","2023-10-17",null,"Issued",null,"H:\\Factors\\2017\\TPS_EW\\Client output\\Tranche 2_2.4%\\CETV bespoke outputs TPS EW - A + B - C v0.13 (2.4% scape).xlsm","Tadeos","2019-01-04T16:01:51"]
["x-716","Final Salary","Added pension","Personal benefits, NPA 60. (Regular contribution elections made on or before 22 June 2010) Monthly contribution per £250 AP at date of election, £","Unisex","Age when notice of election given/ Payment period (in years)",1,716,"1-716","Table R60","Teachers' Pension Scheme: Final salary sections and career average section\nPurchase of additional pension and ceasing monthly contribution elections: Factors and guidance\nDate: 24 June 2019","2023-10-17",null,"Issued",null,"H:\\Factors\\2017\\TPS_EW\\Client output\\Tranche 2_2.4%\\CETV bespoke outputs TPS EW - A + B - C v0.13 (2.4% scape).xlsm","Tadeos","2019-01-04T16:01:51"]
["x-717","Final Salary","Added pension","Personal and dependant's benefits, NPA 60. (Regular contribution elections made on or before 22 June 2010) Monthly contribution per £250 AP at date of election, £","Unisex","Age when notice of election given/ Payment period (in years)",1,717,"1-717","Table R60D","Teachers' Pension Scheme: Final salary sections and career average section\nPurchase of additional pension and ceasing monthly contribution elections: Factors and guidance\nDate: 24 June 2019","2023-10-17",null,"Issued",null,"H:\\Factors\\2017\\TPS_EW\\Client output\\Tranche 2_2.4%\\CETV bespoke outputs TPS EW - A + B - C v0.13 (2.4% scape).xlsm","Tadeos","2019-01-04T16:01:51"]
["x-718","Final Salary","Added pension","Personal benefits, NPA 65. (Regular contribution elections made on or before 22 June 2010) Monthly contribution per £250 AP at date of election, £","Unisex","Age when notice of election given/ Payment period (in years)",1,718,"1-718","Table R65","Teachers' Pension Scheme: Final salary sections and career average section\nPurchase of additional pension and ceasing monthly contribution elections: Factors and guidance\nDate: 24 June 2019","2023-10-17",null,"Issued",null,"H:\\Factors\\2017\\TPS_EW\\Client output\\Tranche 2_2.4%\\CETV bespoke outputs TPS EW - A + B - C v0.13 (2.4% scape).xlsm","Tadeos","2019-01-04T16:01:51"]
["x-719","Final Salary","Added pension","Personal and dependant's benefits, NPA 65. (Regular contribution elections made on or before 22 June 2010) Monthly contribution per £250 AP at date of election, £","Unisex","Age when notice of election given/ Payment period (in years)",1,719,"1-719","Table R65D","Teachers' Pension Scheme: Final salary sections and career average section\nPurchase of additional pension and ceasing monthly contribution elections: Factors and guidance\nDate: 24 June 2019","2023-10-17",null,"Issued",null,"H:\\Factors\\2017\\TPS_EW\\Client output\\Tranche 2_2.4%\\CETV bespoke outputs TPS EW - A + B - C v0.13 (2.4% scape).xlsm","Tadeos","2019-01-04T16:01:51"]
["x-720","Final Salary","Added pension","Purchase of outstanding amount by lump sum (election date on or before 22 June 2010). Single premium per £250 AP at date of election, £. - NPA 60","Unisex","Age when notice of election given",1,720,"1-720","Table SR60","Teachers' Pension Scheme: Final salary sections and career average section\nPurchase of additional pension and ceasing monthly contribution elections: Factors and guidance\nDate: 24 June 2019","2023-10-17",null,"Issued"]
["x-721","Final Salary","Added pension","Purchase of outstanding amount by lump sum (election date on or before 22 June 2010). Single premium per £250 AP at date of election, £. - NPA 65","Unisex","Age when notice of election given",1,721,"1-721","Table SR65","Teachers' Pension Scheme: Final salary sections and career average section\nPurchase of additional pension and ceasing monthly contribution elections: Factors and guidance\nDate: 24 June 2019","2023-10-17",null,"Issued"]
["x-722","Career Average","Buy-out","Buy-out election contribution factors","Unisex","Age entered pensionable service in career average section",0,722,"0-722","Table BO1","Teachers' Pension Scheme: Career average section\nElection to buy out the standard reduction: Factors and guidance\nDate: 11 September 2019","2023-10-17",null,"Issued"]
["x-723","Career Average","Buy-out","Buy-out value factors","Unisex","Number of years between age entered pensionable service in career average section and ‘buy-out retirement age’",0,723,"0-723","Table BO2","Teachers' Pension Scheme: Career average section\nElection to buy out the standard reduction: Factors and guidance\nDate: 11 September 2019","2023-10-17",null,"Issued","TPS_EW_0-723",null,"Tadeos","2019-01-04T16:01:51"]
["x-724","Career Average","Faster accrual","Faster accrual - contribution factors for a faster accrual rate of 1/45","Unisex","Age at date election takes effect",0,724,"0-724","Table FA45","Teachers' Pension Scheme: Career average section\nFaster Accrual: Factors and guidance\nDate: 25 October 2019","2023-10-17",null,"Issued","TPS_EW_0-803","H:\\Factors\\2017\\TPS_EW\\Client output\\Tranche 2_2.4%\\CETV bespoke outputs TPS EW - A + B - C v0.13 (2.4% scape).xlsm","Tadeos","2019-01-04T16:01:51"]
["x-725","Career Average","Faster accrual","Faster accrual - contribution factors for a faster accrual rate of 1/50","Unisex","Age at date election takes effect",0,725,"0-725","Table FA50","Teachers' Pension Scheme: Career average section\nFaster Accrual: Factors and guidance\nDate: 25 October 2019","2023-10-17",null,"Issued","TPS_EW_0-804","H:\\Factors\\2017\\TPS_EW\\Client output\\Tranche 2_2.4%\\CETV bespoke outputs TPS EW - A + B - C v0.13 (2.4% scape).xlsm","Tadeos","2019-01-04T16:01:51"]
["x-726","Career Average","Faster accrual","Faster accrual - contribution factors for a faster accrual rate of 1/55","Unisex","Age at date election takes effect",0,726,"0-726","Table FA55","Teachers' Pension Scheme: Career average section\nFaster Accrual: Factors and guidance\nDate: 25 October 2019","2023-10-17",null,"Issued","TPS_EW_0-805","H:\\Factors\\2017\\TPS_EW\\Client output\\Tranche 2_2.4%\\CETV bespoke outputs TPS EW - A + B - C v0.13 (2.4% scape).xlsm","Tadeos","2019-01-04T16:01:51"]
["x-727","Career Average","Faster accrual","Faster accrual value factors","Unisex","Number of years between age and expected NPA/buy-out retirement age",0,727,"0-727","Table FAV1","Teachers' Pension Scheme: Career average section\nFaster Accrual: Factors and guidance\nDate: 25 October 2019","2023-10-17",null,"Issued","TPS_EW_0-806","H:\\Factors\\2017\\TPS_EW\\Client output\\Tranche 2_2.4%\\CETV bespoke outputs TPS EW - A + B - C v0.13 (2.4% scape).xlsm","Tadeos","2019-01-04T16:01:51"]
["x-728","Final Salary","Additional Family Benefits","Factors for calculating the cost of additional family benefits","Male & Female",null,1,728,"1-728","Table 801","Teachers' Pension Scheme: Final salary section\nPurchasing additional family benefits: Factors and guidance\nDate: 11 September 2019","2023-10-17",null,"Issued","TPS_EW_1-809",null,"Tadeos","2019-01-04T16:01:51"]
["x-729","Career Average","Buy-out","Buy-out value factors - multiplier factor BO3","Unisex",null,0,729,"0-729","Table BO3","Teachers' Pension Scheme: Career average section\nElection to buy out the standard reduction: Factors and guidance\nDate: 11 September 2019","2023-10-17",null,"Issued"]
["x-801","All","Premature Retirement","Factors for capitalising the cost of the member's annual compensation (per £1pa of additional pension)","Unisex","Age last birthday",1,801,"1-801","Table 701","Teachers' Pension Scheme: Final salary sections and career average section\nPremature retirement: Factors for capitalising the cost of compensation\nDate: 3 October 2019","2023-07-28",null,"Issued","TPS_EW_1-801","\\\\Gad-ast\\ast\\Factors\\2017\\TPS_EW\\Client output\\Tranche 1_2.4%\\CETV bespoke outputs TPS EW - A + B - C v0.11_SCAPE 2.4%.xlsm","Meera","2018-11-22T15:52:14"]
["x-802","All","Premature Retirement","Factors for capitalising the cost of the contingent partner's long term compensation (per £1pa of additional pension)","Unisex","Age last birthday",1,802,"1-802","Table 711","Teachers' Pension Scheme: Final salary sections and career average section\nPremature retirement: Factors for capitalising the cost of compensation\nDate: 3 October 2019","2023-07-28",null,"Issued","TPS_EW_1-802","\\\\Gad-ast\\ast\\Factors\\2017\\TPS_EW\\Client output\\Tranche 1_2.4%\\CETV bespoke outputs TPS EW - A + B - C v0.11_SCAPE 2.4%.xlsm","Meera","2018-11-22T15:52:14"]
["x-803","Final Salary","Capitalisation of outstanding PAY and AFB contributions","Contributions due in respect of all of the remaining contribution period","Unisex","Outstanding contributions period (years)",1,803,"1-803","Table 901","Teachers' Pension Scheme: Final salary section\nOutstanding contributions in respect of Past Added Years (PAY) and additional family benefit (AFB) contracts: Factors and guidance\nDate: 11 September 2019","2023-10-17",null,"Issued","TPS_EW_1-807","L:\\Factors\\2017\\TPS_EW\\Client output\\Tranche 1_2.4%\\CETV bespoke outputs TPS EW - A + B - C v0.11_SCAPE 2.4%.xlsm","Thannima","2018-12-04T14:19:46"]
["x-804","Final Salary","Capitalisation of outstanding PAY and AFB contributions","Contributions only due in respect of the contribution period after a member's 60th birthday","Unisex","Period of contributions outstanding from 60th birthday (in years) and Age (in years and months)",1,804,"1-804","Table 911","Teachers' Pension Scheme: Final salary section\nOutstanding contributions in respect of Past Added Years (PAY) and additional family benefit (AFB) contracts: Factors and guidance\nDate: 11 September 2019","2023-10-17",null,"Issued","TPS_EW_1-808","L:\\Factors\\2017\\TPS_EW\\Client output\\Tranche 1_2.4%\\CETV bespoke outputs TPS EW - A + B - C v0.11_SCAPE 2.4%.xlsm","Thannima","2018-12-04T14:19:46"]
["x-805","All","Pension Mis-Selling","Personal pension mis-selling: Interest rates to be applied","Unisex","Period of time",0,805,"0-805","Mis-Selling ","Teachers' Pension Scheme: Final salary section and career average section\nNon-Club incoming transfers: Factors and guidance\nDate: 27 October 2019","2023-10-17",null,"Issued"]

{"sheet":"x-Series Number","index":6,"n_rows":25,"n_cols":2,"rows_kept":25,"cut":false,"hidden":true,"merged":[]}
["Government Actuary's Department"]
[{"$f":"IF(title=\"> Enter workbook title here\",\"Enter workbook title in Cover sheet\",title)","v":"TPS (England & Wales) - Consolidated Factor Spreadsheet"}]
[{"$f":"TABLE_FACTOR_TYPE&\" - x-\"&TABLE_SERIES_NUMBER","v":"Enter the factor type (which should be consistent with the series header types found on the summary sheet (eg early or late retirement) - x-Enter series number (this reflects the number in the relevant series eg if it’s the first ER/LR factor then it would be \"401\")"}]
[{"$f":"CELL(\"filename\",A1)","v":"https://capita-my.sharepoint.com/personal/p10015177_capita_co_uk/Documents/Documents/SPA Stuff/Factor Changes/Batch 4 Factors/[TPS EW Consolidated Factors 2023-04.xlsm]x-Series Number"}]
[]
["Data Item","Factor Table Information"]
["Client","Enter the client name eg NHSPS_EW"]
["Section","Enter the section name eg NHSPS 2015"]
["Factor Type","Enter the factor type (which should be consistent with the series header types found on the summary sheet (eg early or late retirement)"]
["Description","Enter a description of the factor (eg use description from factor table in guidance)"]
["Gender","Enter either \"unisex\" or \"m and f\""]
["Factor Age/Period Definition","Enter in age definition"]
["Section Number","Enter section number (this relates to the number used to identify the scheme section - see top of summary tab for section number)"]
["Series Number","Enter series number (this reflects the number in the relevant series eg if it’s the first ER/LR factor then it would be \"401\")"]
["Table Reference","Enter table number (this is the section number plus the series number so we can identify the section and factor type eg if the section number for NHSPS 2015 was 0 and the factor was the first in the ER/LR factor series then this would be \"0-401\" entered here."]
["Table Reference in Guidance","Enter the table reference from the guidance notes"]
["Related Factor Table Reference (where the factor uses the same table as another factor in this spreadsheet)","If the factor table on this sheet is the same as another factor in the spreadsheet. Then enter that table reference here eg 0-.201. If this factor table is unique then put \"n/a\"."]
["Date Factors Issued to Client","Enter the date the factors are issued to the client"]
["Date Factors Implemented (if known)","Enter the date the factors are implemented "]
["Factor Status","Enter whether table is inforce, withdrawn, refer to gad etc"]
[]
[null,{"$f":"HYPERLINK(\"#'Factor List'!A1\",\"Back to Factor List\")","v":"Back to Factor List"}]
[]
[]
["Copy the relevant factor table and foot notes here. Unisex or male factor table in this grey box."]

{"sheet":"x-101","index":7,"n_rows":73,"n_cols":3,"rows_kept":73,"cut":false,"hidden":false,"merged":[]}
["Government Actuary's Department"]
[{"$f":"IF(title=\"> Enter workbook title here\",\"Enter workbook title in Cover sheet\",title)","v":"TPS (England & Wales) - Consolidated Factor Spreadsheet"}]
[{"$f":"TABLE_FACTOR_TYPE&\" - x-\"&TABLE_SERIES_NUMBER","v":"Club Transfer Adjustments - x-101"}]
[]
[]
["Data Item","Factor Table Information"]
["Client","TPS_EW"]
["Section","Career Average"]
["Factor Type","Club Transfer Adjustments"]
["Description","Club transfer credit adjustment factors"]
["Gender","Male & Female"]
["Factor Age/Period Definition","Age last birthday"]
["Section Number",0]
["Series Number",101]
["Table Reference","x-101"]
["Table Reference in Guidance","Table CTC1"]
["Associated Guidance Note","Teachers' Pension Scheme: Career average section\nClub transfers (supplement to the Club Memorandum): Factors and guidance\nDate: 25 October 2019"]
["Date Factors Issued to Client","2023-10-17"]
["Date Factors Implemented (if known)"]
["Factor Status","Issued"]
[]
[null,{"$f":"HYPERLINK(\"#'Factor List'!A1\",\"Back to Factor List\")","v":"Back to Factor List"}]
[]
[]
["Age","Males","Females"]
[20,3.0000000000000001E-3,3.0000000000000001E-3]
[21,3.0000000000000001E-3,3.0000000000000001E-3]
[22,3.0000000000000001E-3,3.0000000000000001E-3]
[23,3.0000000000000001E-3,3.0000000000000001E-3]
[24,3.0000000000000001E-3,3.0000000000000001E-3]
[25,4.0000000000000001E-3,4.0000000000000001E-3]
[26,4.0000000000000001E-3,4.0000000000000001E-3]
[27,4.0000000000000001E-3,4.0000000000000001E-3]
[28,4.0000000000000001E-3,4.0000000000000001E-3]
[29,5.0000000000000001E-3,5.0000000000000001E-3]
[30,5.0000000000000001E-3,5.0000000000000001E-3]
[31,5.0000000000000001E-3,5.0000000000000001E-3]
[32,5.0000000000000001E-3,5.0000000000000001E-3]
[33,6.0000000000000001E-3,6.0000000000000001E-3]
[34,6.0000000000000001E-3,6.0000000000000001E-3]
[35,6.0000000000000001E-3,6.0000000000000001E-3]
[36,6.0000000000000001E-3,6.0000000000000001E-3]
[37,7.0000000000000001E-3,7.0000000000000001E-3]
[38,7.0000000000000001E-3,7.0000000000000001E-3]
[39,7.0000000000000001E-3,7.0000000000000001E-3]
[40,7.0000000000000001E-3,7.0000000000000001E-3]
[41,7.0000000000000001E-3,7.0000000000000001E-3]
[42,8.0000000000000002E-3,8.0000000000000002E-3]
[43,8.0000000000000002E-3,8.0000000000000002E-3]
[44,8.0000000000000002E-3,8.0000000000000002E-3]
[45,8.9999999999999993E-3,8.9999999999999993E-3]
[46,8.9999999999999993E-3,8.9999999999999993E-3]
[47,8.9999999999999993E-3,8.9999999999999993E-3]
[48,0.01,0.01]
[49,0.01,0.01]
[50,1.0999999999999999E-2,1.0999999999999999E-2]
[51,1.0999999999999999E-2,1.0999999999999999E-2]
[52,1.2E-2,1.2E-2]
[53,1.2E-2,1.2E-2]
[54,1.2999999999999999E-2,1.2999999999999999E-2]
[55,1.2999999999999999E-2,1.2999999999999999E-2]
[56,1.4E-2,1.4E-2]
[57,1.4E-2,1.4E-2]
[58,1.4999999999999999E-2,1.4999999999999999E-2]
[59,1.4999999999999999E-2,1.4999999999999999E-2]
[60,1.6E-2,1.6E-2]
[61,1.7000000000000001E-2,1.7000000000000001E-2]
[62,1.7999999999999999E-2,1.7999999999999999E-2]
[63,1.9E-2,1.9E-2]
[64,0.02,0.02]
[65,2.1000000000000001E-2,2.1000000000000001E-2]
[66,"Refer to GAD","Refer to GAD"]
[67,"Refer to GAD","Refer to GAD"]

{"sheet":"x-202","index":8,"n_rows":65,"n_cols":5,"rows_kept":65,"cut":false,"hidden":false,"merged":[]}
["Government Actuary's Department"]
[{"$f":"IF(title=\"> Enter workbook title here\",\"Enter workbook title in Cover sheet\",title)","v":"TPS (England & Wales) - Consolidated Factor Spreadsheet"}]
[{"$f":"TABLE_FACTOR_TYPE&\" - x-\"&TABLE_SERIES_NUMBER","v":"CETV - x-202"}]
[]
[]
["Data Item","Factor Table Information"]
["Client","TPS_EW"]
["Section","Final Salary"]
["Factor Type","CETV"]
["Description","CETV factors for men, normal pension age of 60"]
["Gender","Male"]
["Factor Age/Period Definition","Age last birthday at relevant date"]
["Section Number",1]
["Series Number",202]
["Table Reference","x-202"]
["Table Reference in Guidance","Table 103"]
["Associated Guidance Note","Teachers' Pension Scheme: Final salary sections and career average section\nCash Equivalent Transfer Values (CETVs): Factors and Guidance\nDate: 27 October 2019"]
["Date Factors Issued to Client","2023-05-26"]
["Date Factors Implemented (if known)"]
["Factor Status","Issued"]
[]
[null,{"$f":"HYPERLINK(\"#'Factor List'!A1\",\"Back to Factor List\")","v":"Back to Factor List"}]
[]
[]
["Age","Gross Pension of £1 pa","Lump Sum of £1","Surviving Partner's Pension of £1 pa","Deduction for NI Modification of £1 pa"]
[20,12.38,0.51,1.2,0]
[21,12.57,0.52,1.22,0]
[22,12.76,0.53,1.24,0]
[23,12.95,0.54,1.26,0]
[24,13.14,0.55000000000000004,1.28,0]
[25,13.34,0.56000000000000005,1.3,0]
[26,13.54,0.56999999999999995,1.31,0]
[27,13.75,0.57999999999999996,1.33,0]
[28,13.96,0.59,1.35,0]
[29,14.17,0.6,1.37,0]
[30,14.38,0.61,1.39,0]
[31,14.6,0.62,1.41,0]
[32,14.82,0.63,1.43,0]
[33,15.04,0.64,1.45,0]
[34,15.27,0.65,1.47,0]
[35,15.5,0.66,1.49,0]
[36,15.74,0.67,1.51,0]
[37,15.98,0.68,1.52,0]
[38,16.22,0.7,1.54,0]
[39,16.47,0.71,1.56,0]
[40,16.72,0.72,1.58,0]
[41,16.98,0.73,1.6,0]
[42,17.239999999999998,0.74,1.61,0]
[43,17.510000000000002,0.76,1.63,0]
[44,17.78,0.77,1.65,0]
[45,18.05,0.78,1.66,0]
[46,18.329999999999998,0.8,1.68,0]
[47,18.62,0.81,1.69,0]
[48,18.91,0.82,1.71,0]
[49,19.21,0.84,1.72,0]
[50,19.510000000000002,0.85,1.73,0]
[51,19.82,0.87,1.74,0]
[52,20.14,0.88,1.76,0]
[53,20.46,0.9,1.77,0]
[54,20.79,0.91,1.78,0]
[55,21.13,0.93,1.78,0]
[56,21.48,0.94,1.79,0]
[57,21.84,0.96,1.8,0]
[58,22.21,0.98,1.8,0]
[59,22.59,0.99,1.8,0]

{"sheet":"x-203","index":9,"n_rows":65,"n_cols":5,"rows_kept":65,"cut":false,"hidden":false,"merged":[]}
["Government Actuary's Department"]
[{"$f":"IF(title=\"> Enter workbook title here\",\"Enter workbook title in Cover sheet\",title)","v":"TPS (England & Wales) - Consolidated Factor Spreadsheet"}]
[{"$f":"TABLE_FACTOR_TYPE&\" - x-\"&TABLE_SERIES_NUMBER","v":"CETV - x-203"}]
[]
[]
["Data Item","Factor Table Information"]
["Client","TPS_EW"]
["Section","Final Salary"]
["Factor Type","CETV"]
["Description","CETV factors for women, normal pension age of 60"]
["Gender","Female"]
["Factor Age/Period Definition","Age last birthday at relevant date"]
["Section Number",1]
["Series Number",203]
["Table Reference","x-203"]
["Table Reference in Guidance","Table 113"]
["Associated Guidance Note","Teachers' Pension Scheme: Final salary sections and career average section\nCash Equivalent Transfer Values (CETVs): Factors and Guidance\nDate: 27 October 2019"]
["Date Factors Issued to Client","2023-05-26"]
["Date Factors Implemented (if known)"]
["Factor Status","Issued"]
[]
[null,{"$f":"HYPERLINK(\"#'Factor List'!A1\",\"Back to Factor List\")","v":"Back to Factor List"}]
[]
[]
["Age","Gross Pension of £1 pa","Lump Sum of £1","Surviving Partner's Pension of £1 pa","Deduction for NI Modification of £1 pa"]
[20,12.38,0.51,1.2,0]
[21,12.57,0.52,1.22,0]
[22,12.76,0.53,1.24,0]
[23,12.95,0.54,1.26,0]
[24,13.14,0.55000000000000004,1.28,0]
[25,13.34,0.56000000000000005,1.3,0]
[26,13.54,0.56999999999999995,1.31,0]
[27,13.75,0.57999999999999996,1.33,0]
[28,13.96,0.59,1.35,0]
[29,14.17,0.6,1.37,0]
[30,14.38,0.61,1.39,0]
[31,14.6,0.62,1.41,0]
[32,14.82,0.63,1.43,0]
[33,15.04,0.64,1.45,0]
[34,15.27,0.65,1.47,0]
[35,15.5,0.66,1.49,0]
[36,15.74,0.67,1.51,0]
[37,15.98,0.68,1.52,0]
[38,16.22,0.7,1.54,0]
[39,16.47,0.71,1.56,0]
[40,16.72,0.72,1.58,0]
[41,16.98,0.73,1.6,0]
[42,17.239999999999998,0.74,1.61,0]
[43,17.510000000000002,0.76,1.63,0]
[44,17.78,0.77,1.65,0]
[45,18.05,0.78,1.66,0]
[46,18.329999999999998,0.8,1.68,0]
[47,18.62,0.81,1.69,0]
[48,18.91,0.82,1.71,0]
[49,19.21,0.84,1.72,0]
[50,19.510000000000002,0.85,1.73,0]
[51,19.82,0.87,1.74,0]
[52,20.14,0.88,1.76,0]
[53,20.46,0.9,1.77,0]
[54,20.79,0.91,1.78,0]
[55,21.13,0.93,1.78,0]
[56,21.48,0.94,1.79,0]
[57,21.84,0.96,1.8,0]
[58,22.21,0.98,1.8,0]
[59,22.59,0.99,1.8,0]

{"sheet":"x-204","index":10,"n_rows":70,"n_cols":4,"rows_kept":70,"cut":false,"hidden":false,"merged":[]}
["Government Actuary's Department"]
[{"$f":"IF(title=\"> Enter workbook title here\",\"Enter workbook title in Cover sheet\",title)","v":"TPS (England & Wales) - Consolidated Factor Spreadsheet"}]
[{"$f":"TABLE_FACTOR_TYPE&\" - x-\"&TABLE_SERIES_NUMBER","v":"CETV - x-204"}]
[]
[]
["Data Item","Factor Table Information"]
["Client","TPS_EW"]
["Section","All"]
["Factor Type","CETV"]
["Description","CETV factors for men, normal pension age of 65"]
["Gender","Male"]
["Factor Age/Period Definition","Age last birthday at relevant date"]
["Section Number",0]
["Series Number",204]
["Table Reference","x-204"]
["Table Reference in Guidance","Table 123"]
["Associated Guidance Note","Teachers' Pension Scheme: Final salary sections and career average section\nCash Equivalent Transfer Values (CETVs): Factors and Guidance\nDate: 27 October 2019"]
["Date Factors Issued to Client","2023-05-26"]
["Date Factors Implemented (if known)"]
["Factor Status","Issued"]
[]
[null,{"$f":"HYPERLINK(\"#'Factor List'!A1\",\"Back to Factor List\")","v":"Back to Factor List"}]
[]
[]
["Age","Gross Pension of £1 pa","Surviving Partner's Pension of £1 pa","Deduction for NI Modification of £1 pa"]
[20,9.99,1.23,0]
[21,10.130000000000001,1.25,0]
[22,10.28,1.27,0]
[23,10.43,1.29,0]
[24,10.59,1.31,0]
[25,10.74,1.33,0]
[26,10.9,1.35,0]
[27,11.06,1.37,0]
[28,11.22,1.39,0]
[29,11.39,1.41,0]
[30,11.55,1.43,0]
[31,11.72,1.45,0]
[32,11.89,1.47,0]
[33,12.07,1.49,0]
[34,12.25,1.51,0]
[35,12.43,1.53,0]
[36,12.61,1.55,0]
[37,12.8,1.56,0]
[38,12.99,1.58,0]
[39,13.18,1.6,0]
[40,13.37,1.62,0]
[41,13.57,1.64,0]
[42,13.77,1.66,0]
[43,13.98,1.68,0]
[44,14.19,1.69,0]
[45,14.4,1.71,0]
[46,14.62,1.73,0]
[47,14.84,1.74,0]
[48,15.06,1.76,0]
[49,15.29,1.77,0]
[50,15.52,1.79,0]
[51,15.76,1.8,0]
[52,16.010000000000002,1.81,0]
[53,16.260000000000002,1.82,0]
[54,16.510000000000002,1.83,0]
[55,16.77,1.84,0]
[56,17.04,1.85,0]
[57,17.309999999999999,1.86,0]
[58,17.600000000000001,1.86,0]
[59,17.89,1.87,0]
[60,18.190000000000001,1.87,0]
[61,18.5,1.87,0]
[62,18.82,1.86,0]
[63,19.16,1.86,0]
[64,19.510000000000002,1.85,0]

{"sheet":"x-205","index":11,"n_rows":65,"n_cols":4,"rows_kept":65,"cut":false,"hidden":false,"merged":[]}
["Government Actuary's Department"]
[{"$f":"IF(title=\"> Enter workbook title here\",\"Enter workbook title in Cover sheet\",title)","v":"TPS (England & Wales) - Consolidated Factor Spreadsheet"}]
[{"$f":"TABLE_FACTOR_TYPE&\" - x-\"&TABLE_SERIES_NUMBER","v":"CETV - x-205"}]
[]
[]
["Data Item","Factor Table Information"]
["Client","TPS_EW"]
["Section","All"]
["Factor Type","CETV"]
["Description","CETV factors for women, normal pension age of 65 - ages 20 to 59"]
["Gender","Female"]
["Factor Age/Period Definition","Age last birthday at relevant date"]
["Section Number",0]
["Series Number",205]
["Table Reference","x-205"]
["Table Reference in Guidance","Table 133a"]
["Associated Guidance Note","Teachers' Pension Scheme: Final salary sections and career average section\nCash Equivalent Transfer Values (CETVs): Factors and Guidance\nDate: 27 October 2019"]
["Date Factors Issued to Client","2023-05-26"]
["Date Factors Implemented (if known)"]
["Factor Status","Issued"]
[]
[null,{"$f":"HYPERLINK(\"#'Factor List'!A1\",\"Back to Factor List\")","v":"Back to Factor List"}]
[]
[]
["Age","Gross Pension of £1 pa","Surviving Partner's Pension of £1 pa","Deduction for NI Modification of £1 pa"]
[20,9.99,1.23,0]
[21,10.130000000000001,1.25,0]
[22,10.28,1.27,0]
[23,10.43,1.29,0]
[24,10.59,1.31,0]
[25,10.74,1.33,0]
[26,10.9,1.35,0]
[27,11.06,1.37,0]
[28,11.22,1.39,0]
[29,11.39,1.41,0]
[30,11.55,1.43,0]
[31,11.72,1.45,0]
[32,11.89,1.47,0]
[33,12.07,1.49,0]
[34,12.25,1.51,0]
[35,12.43,1.53,0]
[36,12.61,1.55,0]
[37,12.8,1.56,0]
[38,12.99,1.58,0]
[39,13.18,1.6,0]
[40,13.37,1.62,0]
[41,13.57,1.64,0]
[42,13.77,1.66,0]
[43,13.98,1.68,0]
[44,14.19,1.69,0]
[45,14.4,1.71,0]
[46,14.62,1.73,0]
[47,14.84,1.74,0]
[48,15.06,1.76,0]
[49,15.29,1.77,0]
[50,15.52,1.79,0]
[51,15.76,1.8,0]
[52,16.010000000000002,1.81,0]
[53,16.260000000000002,1.82,0]
[54,16.510000000000002,1.83,0]
[55,16.77,1.84,0]
[56,17.04,1.85,0]
[57,17.309999999999999,1.86,0]
[58,17.600000000000001,1.86,0]
[59,17.89,1.87,0]

{"sheet":"x-206","index":12,"n_rows":30,"n_cols":4,"rows_kept":30,"cut":false,"hidden":false,"merged":[]}
["Government Actuary's Department"]
[{"$f":"IF(title=\"> Enter workbook title here\",\"Enter workbook title in Cover sheet\",title)","v":"TPS (England & Wales) - Consolidated Factor Spreadsheet"}]
[{"$f":"TABLE_FACTOR_TYPE&\" - x-\"&TABLE_SERIES_NUMBER","v":"CETV - x-206"}]
[]
[]
["Data Item","Factor Table Information"]
["Client","TPS_EW"]
["Section","All"]
["Factor Type","CETV"]
["Description","CETV factors for women, normal pension age of 65 - ages 60 to 64"]
["Gender","Female"]
["Factor Age/Period Definition","Age last birthday at relevant date"]
["Section Number",0]
["Series Number",206]
["Table Reference","x-206"]
["Table Reference in Guidance","Table 133b"]
["Associated Guidance Note","Teachers' Pension Scheme: Final salary sections and career average section\nCash Equivalent Transfer Values (CETVs): Factors and Guidance\nDate: 27 October 2019"]
["Date Factors Issued to Client","2023-05-26"]
["Date Factors Implemented (if known)"]
["Factor Status","Issued"]
[]
[null,{"$f":"HYPERLINK(\"#'Factor List'!A1\",\"Back to Factor List\")","v":"Back to Factor List"}]
[]
[]
["Age","Gross Pension of £1 pa","Surviving Partner's Pension of £1 pa","Deduction for NI Modification of £1 pa"]
[60,18.190000000000001,1.87,0]
[61,18.5,1.87,0]
[62,18.82,1.86,0]
[63,19.16,1.86,0]
[64,19.510000000000002,1.85,0]

{"sheet":"x-207","index":13,"n_rows":70,"n_cols":4,"rows_kept":70,"cut":false,"hidden":false,"merged":[]}
["Government Actuary's Department"]
[{"$f":"IF(title=\"> Enter workbook title here\",\"Enter workbook title in Cover sheet\",title)","v":"TPS (England & Wales) - Consolidated Factor Spreadsheet"}]
[{"$f":"TABLE_FACTOR_TYPE&\" - x-\"&TABLE_SERIES_NUMBER","v":"CETV - x-207"}]
[]
[]
["Data Item","Factor Table Information"]
["Client","TPS_EW"]
["Section","Career Average"]
["Factor Type","CETV"]
["Description","CETV factors for men, normal pension age of 66 - ages 20 to 64"]
["Gender","Male"]
["Factor Age/Period Definition","Age last birthday at relevant date"]
["Section Number",0]
["Series Number",207]
["Table Reference","x-207"]
["Table Reference in Guidance","Table 143a"]
["Associated Guidance Note","Teachers' Pension Scheme: Final salary sections and career average section\nCash Equivalent Transfer Values (CETVs): Factors and Guidance\nDate: 27 October 2019"]
["Date Factors Issued to Client","2023-05-26"]
["Date Factors Implemented (if known)"]
["Factor Status","Issued"]
[]
[null,{"$f":"HYPERLINK(\"#'Factor List'!A1\",\"Back to Factor List\")","v":"Back to Factor List"}]
[]
[]
["Age","Gross Pension of £1 pa","Surviving Partner's Pension of £1 pa","Deduction for NI Modification of £1 pa"]
[20,9.5399999999999991,1.23,0]
[21,9.68,1.25,0]
[22,9.82,1.27,0]
[23,9.9600000000000009,1.29,0]
[24,10.1,1.31,0]
[25,10.25,1.33,0]
[26,10.4,1.35,0]
[27,10.55,1.37,0]
[28,10.7,1.39,0]
[29,10.86,1.41,0]
[30,11.02,1.43,0]
[31,11.18,1.46,0]
[32,11.34,1.48,0]
[33,11.51,1.5,0]
[34,11.68,1.52,0]
[35,11.85,1.54,0]
[36,12.02,1.56,0]
[37,12.2,1.57,0]
[38,12.37,1.59,0]
[39,12.56,1.61,0]
[40,12.74,1.63,0]
[41,12.93,1.65,0]
[42,13.12,1.67,0]
[43,13.31,1.69,0]
[44,13.51,1.71,0]
[45,13.71,1.72,0]
[46,13.92,1.74,0]
[47,14.12,1.76,0]
[48,14.34,1.77,0]
[49,14.55,1.79,0]
[50,14.77,1.8,0]
[51,15,1.81,0]
[52,15.23,1.83,0]
[53,15.46,1.84,0]
[54,15.7,1.85,0]
[55,15.95,1.86,0]
[56,16.2,1.87,0]
[57,16.46,1.87,0]
[58,16.73,1.88,0]
[59,17,1.88,0]
[60,17.29,1.88,0]
[61,17.579999999999998,1.88,0]
[62,17.88,1.88,0]
[63,18.2,1.87,0]
[64,18.53,1.86,0]

{"sheet":"x-208","index":14,"n_rows":26,"n_cols":4,"rows_kept":26,"cut":false,"hidden":false,"merged":[]}
["Government Actuary's Department"]
[{"$f":"IF(title=\"> Enter workbook title here\",\"Enter workbook title in Cover sheet\",title)","v":"TPS (England & Wales) - Consolidated Factor Spreadsheet"}]
[{"$f":"TABLE_FACTOR_TYPE&\" - x-\"&TABLE_SERIES_NUMBER","v":"CETV - x-208"}]
[]
[]
["Data Item","Factor Table Information"]
["Client","TPS_EW"]
["Section","Career Average"]
["Factor Type","CETV"]
["Description","CETV factors for men, normal pension age of 66 - age 65"]
["Gender","Male"]
["Factor Age/Period Definition","Age last birthday at relevant date"]
["Section Number",0]
["Series Number",208]
["Table Reference","x-208"]
["Table Reference in Guidance","Table 143b"]
["Associated Guidance Note","Teachers' Pension Scheme: Final salary sections and career average section\nCash Equivalent Transfer Values (CETVs): Factors and Guidance\nDate: 27 October 2019"]
["Date Factors Issued to Client","2023-05-26"]
["Date Factors Implemented (if known)"]
["Factor Status","Issued"]
[]
[null,{"$f":"HYPERLINK(\"#'Factor List'!A1\",\"Back to Factor List\")","v":"Back to Factor List"}]
[]
[]
["Age","Gross Pension of £1 pa","Surviving Partner's Pension of £1 pa","Deduction for NI Modification of £1 pa"]
[65,18.87,1.85,0]

{"sheet":"x-209","index":15,"n_rows":65,"n_cols":4,"rows_kept":65,"cut":false,"hidden":false,"merged":[]}
["Government Actuary's Department"]
[{"$f":"IF(title=\"> Enter workbook title here\",\"Enter workbook title in Cover sheet\",title)","v":"TPS (England & Wales) - Consolidated Factor Spreadsheet"}]
[{"$f":"TABLE_FACTOR_TYPE&\" - x-\"&TABLE_SERIES_NUMBER","v":"CETV - x-209"}]
[]
[]
["Data Item","Factor Table Information"]
["Client","TPS_EW"]
["Section","Career Average"]
["Factor Type","CETV"]
["Description","CETV factors for women, normal pension age of 66 - ages 20 to 59"]
["Gender","Female"]
["Factor Age/Period Definition","Age last birthday at relevant date"]
["Section Number",0]
["Series Number",209]
["Table Reference","x-209"]
["Table Reference in Guidance","Table 153a"]
["Associated Guidance Note","Teachers' Pension Scheme: Final salary sections and career average section\nCash Equivalent Transfer Values (CETVs): Factors and Guidance\nDate: 27 October 2019"]
["Date Factors Issued to Client","2023-05-26"]
["Date Factors Implemented (if known)"]
["Factor Status","Issued"]
[]
[null,{"$f":"HYPERLINK(\"#'Factor List'!A1\",\"Back to Factor List\")","v":"Back to Factor List"}]
[]
[]
["Age","Gross Pension of £1 pa","Surviving Partner's Pension of £1 pa","Deduction for NI Modification of £1 pa"]
[20,9.5399999999999991,1.23,0]
[21,9.68,1.25,0]
[22,9.82,1.27,0]
[23,9.9600000000000009,1.29,0]
[24,10.1,1.31,0]
[25,10.25,1.33,0]
[26,10.4,1.35,0]
[27,10.55,1.37,0]
[28,10.7,1.39,0]
[29,10.86,1.41,0]
[30,11.02,1.43,0]
[31,11.18,1.46,0]
[32,11.34,1.48,0]
[33,11.51,1.5,0]
[34,11.68,1.52,0]
[35,11.85,1.54,0]
[36,12.02,1.56,0]
[37,12.2,1.57,0]
[38,12.37,1.59,0]
[39,12.56,1.61,0]
[40,12.74,1.63,0]
[41,12.93,1.65,0]
[42,13.12,1.67,0]
[43,13.31,1.69,0]
[44,13.51,1.71,0]
[45,13.71,1.72,0]
[46,13.92,1.74,0]
[47,14.12,1.76,0]
[48,14.34,1.77,0]
[49,14.55,1.79,0]
[50,14.77,1.8,0]
[51,15,1.81,0]
[52,15.23,1.83,0]
[53,15.46,1.84,0]
[54,15.7,1.85,0]
[55,15.95,1.86,0]
[56,16.2,1.87,0]
[57,16.46,1.87,0]
[58,16.73,1.88,0]
[59,17,1.88,0]

{"sheet":"x-210","index":16,"n_rows":31,"n_cols":4,"rows_kept":31,"cut":false,"hidden":false,"merged":[]}
["Government Actuary's Department"]
[{"$f":"IF(title=\"> Enter workbook title here\",\"Enter workbook title in Cover sheet\",title)","v":"TPS (England & Wales) - Consolidated Factor Spreadsheet"}]
[{"$f":"TABLE_FACTOR_TYPE&\" - x-\"&TABLE_SERIES_NUMBER","v":"CETV - x-210"}]
[]
[]
["Data Item","Factor Table Information"]
["Client","TPS_EW"]
["Section","Career Average"]
["Factor Type","CETV"]
["Description","CETV factors for women, normal pension age of 66 - ages 60 to 65"]
["Gender","Female"]
["Factor Age/Period Definition","Age last birthday at relevant date"]
["Section Number",0]
["Series Number",210]
["Table Reference","x-210"]
["Table Reference in Guidance","Table 153b"]
["Associated Guidance Note","Teachers' Pension Scheme: Final salary sections and career average section\nCash Equivalent Transfer Values (CETVs): Factors and Guidance\nDate: 27 October 2019"]
["Date Factors Issued to Client","2023-05-26"]
["Date Factors Implemented (if known)"]
["Factor Status","Issued"]
[]
[null,{"$f":"HYPERLINK(\"#'Factor List'!A1\",\"Back to Factor List\")","v":"Back to Factor List"}]
[]
[]
["Age","Gross Pension of £1 pa","Surviving Partner's Pension of £1 pa","Deduction for NI Modification of £1 pa"]
[60,17.29,1.88,0]
[61,17.579999999999998,1.88,0]
[62,17.88,1.88,0]
[63,18.2,1.87,0]
[64,18.53,1.86,0]
[65,18.87,1.85,0]

{"sheet":"x-211","index":17,"n_rows":70,"n_cols":4,"rows_kept":70,"cut":false,"hidden":false,"merged":[]}
["Government Actuary's Department"]
[{"$f":"IF(title=\"> Enter workbook title here\",\"Enter workbook title in Cover sheet\",title)","v":"TPS (England & Wales) - Consolidated Factor Spreadsheet"}]
[{"$f":"TABLE_FACTOR_TYPE&\" - x-\"&TABLE_SERIES_NUMBER","v":"CETV - x-211"}]
[]
[]
["Data Item","Factor Table Information"]
["Client","TPS_EW"]
["Section","Career Average"]
["Factor Type","CETV"]
["Description","CETV factors for men, normal pension age of 67 - ages 20 to 64"]
["Gender","Male"]
["Factor Age/Period Definition","Age last birthday at relevant date"]
["Section Number",0]
["Series Number",211]
["Table Reference","x-211"]
["Table Reference in Guidance","Table 163a"]
["Associated Guidance Note","Teachers' Pension Scheme: Final salary sections and career average section\nCash Equivalent Transfer Values (CETVs): Factors and Guidance\nDate: 27 October 2019"]
["Date Factors Issued to Client","2023-05-26"]
["Date Factors Implemented (if known)"]
["Factor Status","Issued"]
[]
[null,{"$f":"HYPERLINK(\"#'Factor List'!A1\",\"Back to Factor List\")","v":"Back to Factor List"}]
[]
[]
["Age","Gross Pension of £1 pa","Surviving Partner's Pension of £1 pa","Deduction for NI Modification of £1 pa"]
[20,9.09,1.24,0]
[21,9.23,1.26,0]
[22,9.36,1.28,0]
[23,9.49,1.3,0]
[24,9.6300000000000008,1.32,0]
[25,9.77,1.34,0]
[26,9.91,1.36,0]
[27,10.050000000000001,1.38,0]
[28,10.199999999999999,1.4,0]
[29,10.35,1.42,0]
[30,10.5,1.44,0]
[31,10.65,1.46,0]
[32,10.8,1.49,0]
[33,10.96,1.51,0]
[34,11.12,1.53,0]
[35,11.28,1.55,0]
[36,11.44,1.57,0]
[37,11.61,1.59,0]
[38,11.78,1.61,0]
[39,11.95,1.63,0]
[40,12.12,1.64,0]
[41,12.3,1.66,0]
[42,12.48,1.68,0]
[43,12.66,1.7,0]
[44,12.85,1.72,0]
[45,13.04,1.74,0]
[46,13.23,1.75,0]
[47,13.43,1.77,0]
[48,13.63,1.78,0]
[49,13.83,1.8,0]
[50,14.04,1.81,0]
[51,14.25,1.83,0]
[52,14.47,1.84,0]
[53,14.69,1.85,0]
[54,14.92,1.86,0]
[55,15.15,1.87,0]
[56,15.38,1.88,0]
[57,15.63,1.89,0]
[58,15.88,1.89,0]
[59,16.14,1.9,0]
[60,16.41,1.9,0]
[61,16.68,1.9,0]
[62,16.97,1.9,0]
[63,17.27,1.89,0]
[64,17.579999999999998,1.88,0]

{"sheet":"x-212","index":18,"n_rows":27,"n_cols":4,"rows_kept":27,"cut":false,"hidden":false,"merged":[]}
["Government Actuary's Department"]
[{"$f":"IF(title=\"> Enter workbook title here\",\"Enter workbook title in Cover sheet\",title)","v":"TPS (England & Wales) - Consolidated Factor Spreadsheet"}]
[{"$f":"TABLE_FACTOR_TYPE&\" - x-\"&TABLE_SERIES_NUMBER","v":"CETV - x-212"}]
[]
[]
["Data Item","Factor Table Information"]
["Client","TPS_EW"]
["Section","Career Average"]
["Factor Type","CETV"]
["Description","CETV factors for men, normal pension age of 67 - ages 65 to 66"]
["Gender","Male"]
["Factor Age/Period Definition","Age last birthday at relevant date"]
["Section Number",0]
["Series Number",212]
["Table Reference","x-212"]
["Table Reference in Guidance","Table 163b"]
["Associated Guidance Note","Teachers' Pension Scheme: Final salary sections and career average section\nCash Equivalent Transfer Values (CETVs): Factors and Guidance\nDate: 27 October 2019"]
["Date Factors Issued to Client","2023-05-26"]
["Date Factors Implemented (if known)"]
["Factor Status","Issued"]
[]
[null,{"$f":"HYPERLINK(\"#'Factor List'!A1\",\"Back to Factor List\")","v":"Back to Factor List"}]
[]
[]
["Age","Gross Pension of £1 pa","Surviving Partner's Pension of £1 pa","Deduction for NI Modification of £1 pa"]
[65,17.899999999999999,1.87,0]
[66,18.239999999999998,1.86,0]

{"sheet":"x-213","index":19,"n_rows":65,"n_cols":4,"rows_kept":65,"cut":false,"hidden":false,"merged":[]}
["Government Actuary's Department"]
[{"$f":"IF(title=\"> Enter workbook title here\",\"Enter workbook title in Cover sheet\",title)","v":"TPS (England & Wales) - Consolidated Factor Spreadsheet"}]
[{"$f":"TABLE_FACTOR_TYPE&\" - x-\"&TABLE_SERIES_NUMBER","v":"CETV - x-213"}]
[]
[]
["Data Item","Factor Table Information"]
["Client","TPS_EW"]
["Section","Career Average"]
["Factor Type","CETV"]
["Description","CETV factors for women, normal pension age of 67 - ages 20 to 59"]
["Gender","Female"]
["Factor Age/Period Definition","Age last birthday at relevant date"]
["Section Number",0]
["Series Number",213]
["Table Reference","x-213"]
["Table Reference in Guidance","Table 173a"]
["Associated Guidance Note","Teachers' Pension Scheme: Final salary sections and career average section\nCash Equivalent Transfer Values (CETVs): Factors and Guidance\nDate: 27 October 2019"]
["Date Factors Issued to Client","2023-05-26"]
["Date Factors Implemented (if known)"]
["Factor Status","Issued"]
[]
[null,{"$f":"HYPERLINK(\"#'Factor List'!A1\",\"Back to Factor List\")","v":"Back to Factor List"}]
[]
[]
["Age","Gross Pension of £1 pa","Surviving Partner's Pension of £1 pa","Deduction for NI Modification of £1 pa"]
[20,9.09,1.24,0]
[21,9.23,1.26,0]
[22,9.36,1.28,0]
[23,9.49,1.3,0]
[24,9.6300000000000008,1.32,0]
[25,9.77,1.34,0]
[26,9.91,1.36,0]
[27,10.050000000000001,1.38,0]
[28,10.199999999999999,1.4,0]
[29,10.35,1.42,0]
[30,10.5,1.44,0]
[31,10.65,1.46,0]
[32,10.8,1.49,0]
[33,10.96,1.51,0]
[34,11.12,1.53,0]
[35,11.28,1.55,0]
[36,11.44,1.57,0]
[37,11.61,1.59,0]
[38,11.78,1.61,0]
[39,11.95,1.63,0]
[40,12.12,1.64,0]
[41,12.3,1.66,0]
[42,12.48,1.68,0]
[43,12.66,1.7,0]
[44,12.85,1.72,0]
[45,13.04,1.74,0]
[46,13.23,1.75,0]
[47,13.43,1.77,0]
[48,13.63,1.78,0]
[49,13.83,1.8,0]
[50,14.04,1.81,0]
[51,14.25,1.83,0]
[52,14.47,1.84,0]
[53,14.69,1.85,0]
[54,14.92,1.86,0]
[55,15.15,1.87,0]
[56,15.38,1.88,0]
[57,15.63,1.89,0]
[58,15.88,1.89,0]
[59,16.14,1.9,0]

{"sheet":"x-214","index":20,"n_rows":32,"n_cols":4,"rows_kept":32,"cut":false,"hidden":false,"merged":[]}
["Government Actuary's Department"]
[{"$f":"IF(title=\"> Enter workbook title here\",\"Enter workbook title in Cover sheet\",title)","v":"TPS (England & Wales) - Consolidated Factor Spreadsheet"}]
[{"$f":"TABLE_FACTOR_TYPE&\" - x-\"&TABLE_SERIES_NUMBER","v":"CETV - x-214"}]
[]
[]
["Data Item","Factor Table Information"]
["Client","TPS_EW"]
["Section","Career Average"]
["Factor Type","CETV"]
["Description","CETV factors for women, normal pension age of 67 - ages 60 to 66"]
["Gender","Female"]
["Factor Age/Period Definition","Age last birthday at relevant date"]
["Section Number",0]
["Series Number",214]
["Table Reference","x-214"]
["Table Reference in Guidance","Table 173b"]
["Associated Guidance Note","Teachers' Pension Scheme: Final salary sections and career average section\nCash Equivalent Transfer Values (CETVs): Factors and Guidance\nDate: 27 October 2019"]
["Date Factors Issued to Client","2023-05-26"]
["Date Factors Implemented (if known)"]
["Factor Status","Issued"]
[]
[null,{"$f":"HYPERLINK(\"#'Factor List'!A1\",\"Back to Factor List\")","v":"Back to Factor List"}]
[]
[]
["Age","Gross Pension of £1 pa","Surviving Partner's Pension of £1 pa","Deduction for NI Modification of £1 pa"]
[60,16.41,1.9,0]
[61,16.68,1.9,0]
[62,16.97,1.9,0]
[63,17.27,1.89,0]
[64,17.579999999999998,1.88,0]
[65,17.899999999999999,1.87,0]
[66,18.239999999999998,1.86,0]

{"sheet":"x-215","index":21,"n_rows":70,"n_cols":4,"rows_kept":70,"cut":false,"hidden":false,"merged":[]}
["Government Actuary's Department"]
[{"$f":"IF(title=\"> Enter workbook title here\",\"Enter workbook title in Cover sheet\",title)","v":"TPS (England & Wales) - Consolidated Factor Spreadsheet"}]
[{"$f":"TABLE_FACTOR_TYPE&\" - x-\"&TABLE_SERIES_NUMBER","v":"CETV - x-215"}]
[]
[]
["Data Item","Factor Table Information"]
["Client","TPS_EW"]
["Section","Career Average"]
["Factor Type","CETV"]
["Description","CETV factors for men, normal pension age of 68 - ages 20 to 64"]
["Gender","Male"]
["Factor Age/Period Definition","Age last birthday at relevant date"]
["Section Number",0]
["Series Number",215]
["Table Reference","x-215"]
["Table Reference in Guidance","Table 183a"]
["Associated Guidance Note","Teachers' Pension Scheme: Final salary sections and career average section\nCash Equivalent Transfer Values (CETVs): Factors and Guidance\nDate: 27 October 2019"]
["Date Factors Issued to Client","2023-05-26"]
["Date Factors Implemented (if known)"]
["Factor Status","Issued"]
[]
[null,{"$f":"HYPERLINK(\"#'Factor List'!A1\",\"Back to Factor List\")","v":"Back to Factor List"}]
[]
[]
["Age","Gross Pension of £1 pa","Surviving Partner's Pension of £1 pa","Deduction for NI Modification of £1 pa"]
[20,8.66,1.25,0]
[21,8.7799999999999994,1.27,0]
[22,8.91,1.29,0]
[23,9.0399999999999991,1.31,0]
[24,9.17,1.33,0]
[25,9.3000000000000007,1.35,0]
[26,9.43,1.37,0]
[27,9.57,1.39,0]
[28,9.6999999999999993,1.41,0]
[29,9.84,1.43,0]
[30,9.98,1.45,0]
[31,10.130000000000001,1.47,0]
[32,10.27,1.5,0]
[33,10.42,1.52,0]
[34,10.57,1.54,0]
[35,10.72,1.56,0]
[36,10.88,1.58,0]
[37,11.03,1.6,0]
[38,11.19,1.62,0]
[39,11.35,1.64,0]
[40,11.52,1.66,0]
[41,11.68,1.68,0]
[42,11.85,1.7,0]
[43,12.03,1.71,0]
[44,12.2,1.73,0]
[45,12.38,1.75,0]
[46,12.56,1.77,0]
[47,12.74,1.78,0]
[48,12.93,1.8,0]
[49,13.12,1.82,0]
[50,13.32,1.83,0]
[51,13.52,1.84,0]
[52,13.72,1.86,0]
[53,13.93,1.87,0]
[54,14.14,1.88,0]
[55,14.36,1.89,0]
[56,14.58,1.9,0]
[57,14.81,1.91,0]
[58,15.05,1.91,0]
[59,15.29,1.92,0]
[60,15.54,1.92,0]
[61,15.8,1.92,0]
[62,16.07,1.91,0]
[63,16.350000000000001,1.91,0]
[64,16.64,1.9,0]

{"sheet":"x-216","index":22,"n_rows":28,"n_cols":4,"rows_kept":28,"cut":false,"hidden":false,"merged":[]}
["Government Actuary's Department"]
[{"$f":"IF(title=\"> Enter workbook title here\",\"Enter workbook title in Cover sheet\",title)","v":"TPS (England & Wales) - Consolidated Factor Spreadsheet"}]
[{"$f":"TABLE_FACTOR_TYPE&\" - x-\"&TABLE_SERIES_NUMBER","v":"CETV - x-216"}]
[]
[]
["Data Item","Factor Table Information"]
["Client","TPS_EW"]
["Section","Career Average"]
["Factor Type","CETV"]
["Description","CETV factors for men, normal pension age of 68 - ages 65 to 67"]
["Gender","Male"]
["Factor Age/Period Definition","Age last birthday at relevant date"]
["Section Number",0]
["Series Number",216]
["Table Reference","x-216"]
["Table Reference in Guidance","Table 183b"]
["Associated Guidance Note","Teachers' Pension Scheme: Final salary sections and career average section\nCash Equivalent Transfer Values (CETVs): Factors and Guidance\nDate: 27 October 2019"]
["Date Factors Issued to Client","2023-05-26"]
["Date Factors Implemented (if known)"]
["Factor Status","Issued"]
[]
[null,{"$f":"HYPERLINK(\"#'Factor List'!A1\",\"Back to Factor List\")","v":"Back to Factor List"}]
[]
[]
["Age","Gross Pension of £1 pa","Surviving Partner's Pension of £1 pa","Deduction for NI Modification of £1 pa"]
[65,16.95,1.89,0]
[66,17.27,1.87,0]
[67,17.600000000000001,1.86,0]

{"sheet":"x-217","index":23,"n_rows":65,"n_cols":4,"rows_kept":65,"cut":false,"hidden":false,"merged":[]}
["Government Actuary's Department"]
[{"$f":"IF(title=\"> Enter workbook title here\",\"Enter workbook title in Cover sheet\",title)","v":"TPS (England & Wales) - Consolidated Factor Spreadsheet"}]
[{"$f":"TABLE_FACTOR_TYPE&\" - x-\"&TABLE_SERIES_NUMBER","v":"CETV - x-217"}]
[]
[]
["Data Item","Factor Table Information"]
["Client","TPS_EW"]
["Section","Career Average"]
["Factor Type","CETV"]
["Description","CETV factors for women, normal pension age of 68 - ages 20 to 59"]
["Gender","Female"]
["Factor Age/Period Definition","Age last birthday at relevant date"]
["Section Number",0]
["Series Number",217]
["Table Reference","x-217"]
["Table Reference in Guidance","Table 193a"]
["Associated Guidance Note","Teachers' Pension Scheme: Final salary sections and career average section\nCash Equivalent Transfer Values (CETVs): Factors and Guidance\nDate: 27 October 2019"]
["Date Factors Issued to Client","2023-05-26"]
["Date Factors Implemented (if known)"]
["Factor Status","Issued"]
[]
[null,{"$f":"HYPERLINK(\"#'Factor List'!A1\",\"Back to Factor List\")","v":"Back to Factor List"}]
[]
[]
["Age","Gross Pension of £1 pa","Surviving Partner's Pension of £1 pa","Deduction for NI Modification of £1 pa"]
[20,8.66,1.25,0]
[21,8.7799999999999994,1.27,0]
[22,8.91,1.29,0]
[23,9.0399999999999991,1.31,0]
[24,9.17,1.33,0]
[25,9.3000000000000007,1.35,0]
[26,9.43,1.37,0]
[27,9.57,1.39,0]
[28,9.6999999999999993,1.41,0]
[29,9.84,1.43,0]
[30,9.98,1.45,0]
[31,10.130000000000001,1.47,0]
[32,10.27,1.5,0]
[33,10.42,1.52,0]
[34,10.57,1.54,0]
[35,10.72,1.56,0]
[36,10.88,1.58,0]
[37,11.03,1.6,0]
[38,11.19,1.62,0]
[39,11.35,1.64,0]
[40,11.52,1.66,0]
[41,11.68,1.68,0]
[42,11.85,1.7,0]
[43,12.03,1.71,0]
[44,12.2,1.73,0]
[45,12.38,1.75,0]
[46,12.56,1.77,0]
[47,12.74,1.78,0]
[48,12.93,1.8,0]
[49,13.12,1.82,0]
[50,13.32,1.83,0]
[51,13.52,1.84,0]
[52,13.72,1.86,0]
[53,13.93,1.87,0]
[54,14.14,1.88,0]
[55,14.36,1.89,0]
[56,14.58,1.9,0]
[57,14.81,1.91,0]
[58,15.05,1.91,0]
[59,15.29,1.92,0]

{"sheet":"x-218","index":24,"n_rows":33,"n_cols":4,"rows_kept":33,"cut":false,"hidden":false,"merged":[]}
["Government Actuary's Department"]
[{"$f":"IF(title=\"> Enter workbook title here\",\"Enter workbook title in Cover sheet\",title)","v":"TPS (England & Wales) - Consolidated Factor Spreadsheet"}]
[{"$f":"TABLE_FACTOR_TYPE&\" - x-\"&TABLE_SERIES_NUMBER","v":"CETV - x-218"}]
[]
[]
["Data Item","Factor Table Information"]
["Client","TPS_EW"]
["Section","Career Average"]
["Factor Type","CETV"]
["Description","CETV factors for women, normal pension age of 68 - ages 60 to 67"]
["Gender","Female"]
["Factor Age/Period Definition","Age last birthday at relevant date"]
["Section Number",0]
["Series Number",218]
["Table Reference","x-218"]
["Table Reference in Guidance","Table 193b"]
["Associated Guidance Note","Teachers' Pension Scheme: Final salary sections and career average section\nCash Equivalent Transfer Values (CETVs): Factors and Guidance\nDate: 27 October 2019"]
["Date Factors Issued to Client","2023-05-26"]
["Date Factors Implemented (if known)"]
["Factor Status","Issued"]
[]
[null,{"$f":"HYPERLINK(\"#'Factor List'!A1\",\"Back to Factor List\")","v":"Back to Factor List"}]
[]
[]
["Age","Gross Pension of £1 pa","Surviving Partner's Pension of £1 pa","Deduction for NI Modification of £1 pa"]
[60,15.54,1.92,0]
[61,15.8,1.92,0]
[62,16.07,1.91,0]
[63,16.350000000000001,1.91,0]
[64,16.64,1.9,0]
[65,16.95,1.89,0]
[66,17.27,1.87,0]
[67,17.600000000000001,1.86,0]

{"sheet":"x-219","index":25,"n_rows":65,"n_cols":3,"rows_kept":65,"cut":false,"hidden":false,"merged":[]}
["Government Actuary's Department"]
[{"$f":"IF(title=\"> Enter workbook title here\",\"Enter workbook title in Cover sheet\",title)","v":"TPS (England & Wales) - Consolidated Factor Spreadsheet"}]
[{"$f":"TABLE_FACTOR_TYPE&\" - x-\"&TABLE_SERIES_NUMBER","v":"CETV - x-219"}]
[]
[]
["Data Item","Factor Table Information"]
["Client","TPS_EW"]
["Section","All"]
["Factor Type","CETV"]
["Description","CETV factors for men, NPA 60, AP in respect of an election on or before 22 June 2010"]
["Gender","Male"]
["Factor Age/Period Definition","Age last birthday at relevant date"]
["Section Number",0]
["Series Number",219]
["Table Reference","x-219"]
["Table Reference in Guidance","Table CEM60R"]
["Associated Guidance Note","Teachers' Pension Scheme: Final salary sections and career average section\nCash Equivalent Transfer Values (CETVs): Factors and Guidance\nDate: 27 October 2019"]
["Date Factors Issued to Client","2023-05-26"]
["Date Factors Implemented (if known)"]
["Factor Status","Issued"]
[]
[null,{"$f":"HYPERLINK(\"#'Factor List'!A1\",\"Back to Factor List\")","v":"Back to Factor List"}]
[]
[]
["Age","Gross Pension of £1 pa","Surviving Partner's pension of £1 pa"]
[20,13.68,1.33]
[21,13.88,1.35]
[22,14.07,1.37]
[23,14.27,1.39]
[24,14.47,1.41]
[25,14.68,1.42]
[26,14.88,1.44]
[27,15.09,1.46]
[28,15.31,1.48]
[29,15.52,1.5]
[30,15.74,1.52]
[31,15.96,1.54]
[32,16.190000000000001,1.56]
[33,16.420000000000002,1.58]
[34,16.649999999999999,1.6]
[35,16.89,1.62]
[36,17.13,1.64]
[37,17.37,1.66]
[38,17.62,1.67]
[39,17.87,1.69]
[40,18.13,1.71]
[41,18.39,1.73]
[42,18.649999999999999,1.75]
[43,18.920000000000002,1.76]
[44,19.190000000000001,1.78]
[45,19.47,1.79]
[46,19.75,1.81]
[47,20.04,1.82]
[48,20.34,1.83]
[49,20.64,1.85]
[50,20.94,1.86]
[51,21.25,1.87]
[52,21.57,1.88]
[53,21.9,1.89]
[54,22.11,1.89]
[55,22.21,1.88]
[56,22.33,1.86]
[57,22.45,1.85]
[58,22.58,1.83]
[59,22.71,1.81]

{"sheet":"x-220","index":26,"n_rows":65,"n_cols":3,"rows_kept":65,"cut":false,"hidden":false,"merged":[]}
["Government Actuary's Department"]
[{"$f":"IF(title=\"> Enter workbook title here\",\"Enter workbook title in Cover sheet\",title)","v":"TPS (England & Wales) - Consolidated Factor Spreadsheet"}]
[{"$f":"TABLE_FACTOR_TYPE&\" - x-\"&TABLE_SERIES_NUMBER","v":"CETV - x-220"}]
[]
[]
["Data Item","Factor Table Information"]
["Client","TPS_EW"]
["Section","All"]
["Factor Type","CETV"]
["Description","CETV factors for women, NPA 60, AP in respect of election on or before 22 June 2010"]
["Gender","Female"]
["Factor Age/Period Definition","Age last birthday at relevant date"]
["Section Number",0]
["Series Number",220]
["Table Reference","x-220"]
["Table Reference in Guidance","Table CEF60R"]
["Associated Guidance Note","Teachers' Pension Scheme: Final salary sections and career average section\nCash Equivalent Transfer Values (CETVs): Factors and Guidance\nDate: 27 October 2019"]
["Date Factors Issued to Client","2023-05-26"]
["Date Factors Implemented (if known)"]
["Factor Status","Issued"]
[]
[null,{"$f":"HYPERLINK(\"#'Factor List'!A1\",\"Back to Factor List\")","v":"Back to Factor List"}]
[]
[]
["Age","Gross Pension of £1 pa","Surviving Partner's pension of £1 pa"]
[20,13.68,1.33]
[21,13.88,1.35]
[22,14.07,1.37]
[23,14.27,1.39]
[24,14.47,1.41]
[25,14.68,1.42]
[26,14.88,1.44]
[27,15.09,1.46]
[28,15.31,1.48]
[29,15.52,1.5]
[30,15.74,1.52]
[31,15.96,1.54]
[32,16.190000000000001,1.56]
[33,16.420000000000002,1.58]
[34,16.649999999999999,1.6]
[35,16.89,1.62]
[36,17.13,1.64]
[37,17.37,1.66]
[38,17.62,1.67]
[39,17.87,1.69]
[40,18.13,1.71]
[41,18.39,1.73]
[42,18.649999999999999,1.75]
[43,18.920000000000002,1.76]
[44,19.190000000000001,1.78]
[45,19.47,1.79]
[46,19.75,1.81]
[47,20.04,1.82]
[48,20.34,1.83]
[49,20.64,1.85]
[50,20.94,1.86]
[51,21.25,1.87]
[52,21.57,1.88]
[53,21.9,1.89]
[54,22.11,1.89]
[55,22.21,1.88]
[56,22.33,1.86]
[57,22.45,1.85]
[58,22.58,1.83]
[59,22.71,1.81]

{"sheet":"x-221","index":27,"n_rows":70,"n_cols":3,"rows_kept":70,"cut":false,"hidden":false,"merged":[]}
["Government Actuary's Department"]
[{"$f":"IF(title=\"> Enter workbook title here\",\"Enter workbook title in Cover sheet\",title)","v":"TPS (England & Wales) - Consolidated Factor Spreadsheet"}]
[{"$f":"TABLE_FACTOR_TYPE&\" - x-\"&TABLE_SERIES_NUMBER","v":"CETV - x-221"}]
[]
[]
["Data Item","Factor Table Information"]
["Client","TPS_EW"]
["Section","All"]
["Factor Type","CETV"]
["Description","CETV factors for men, NPA 65, AP in respect of an election on or before 22 June 2010"]
["Gender","Male"]
["Factor Age/Period Definition","Age last birthday at relevant date"]
["Section Number",0]
["Series Number",221]
["Table Reference","x-221"]
["Table Reference in Guidance","Table CEM65R"]
["Associated Guidance Note","Teachers' Pension Scheme: Final salary sections and career average section\nCash Equivalent Transfer Values (CETVs): Factors and Guidance\nDate: 27 October 2019"]
["Date Factors Issued to Client","2023-05-26"]
["Date Factors Implemented (if known)"]
["Factor Status","Issued"]
[]
[null,{"$f":"HYPERLINK(\"#'Factor List'!A1\",\"Back to Factor List\")","v":"Back to Factor List"}]
[]
[]
["Age","Gross Pension of £1 pa","Surviving Partner's pension of £1 pa"]
[20,11.1,1.36]
[21,11.25,1.38]
[22,11.4,1.4]
[23,11.56,1.42]
[24,11.71,1.44]
[25,11.87,1.47]
[26,12.04,1.49]
[27,12.2,1.51]
[28,12.37,1.53]
[29,12.54,1.55]
[30,12.71,1.57]
[31,12.88,1.59]
[32,13.06,1.61]
[33,13.24,1.63]
[34,13.42,1.65]
[35,13.6,1.67]
[36,13.79,1.69]
[37,13.98,1.71]
[38,14.17,1.73]
[39,14.37,1.75]
[40,14.57,1.77]
[41,14.77,1.79]
[42,14.97,1.8]
[43,15.18,1.82]
[44,15.39,1.84]
[45,15.61,1.85]
[46,15.83,1.87]
[47,16.05,1.89]
[48,16.28,1.9]
[49,16.510000000000002,1.91]
[50,16.739999999999998,1.93]
[51,16.98,1.94]
[52,17.23,1.95]
[53,17.48,1.96]
[54,17.739999999999998,1.97]
[55,18,1.98]
[56,18.27,1.98]
[57,18.55,1.99]
[58,18.829999999999998,1.99]
[59,19.02,1.98]
[60,19.11,1.96]
[61,19.21,1.94]
[62,19.329999999999998,1.92]
[63,19.47,1.89]
[64,19.61,1.86]

{"sheet":"x-222","index":28,"n_rows":70,"n_cols":3,"rows_kept":70,"cut":false,"hidden":false,"merged":[]}
["Government Actuary's Department"]
[{"$f":"IF(title=\"> Enter workbook title here\",\"Enter workbook title in Cover sheet\",title)","v":"TPS (England & Wales) - Consolidated Factor Spreadsheet"}]
[{"$f":"TABLE_FACTOR_TYPE&\" - x-\"&TABLE_SERIES_NUMBER","v":"CETV - x-222"}]
[]
[]
["Data Item","Factor Table Information"]
["Client","TPS_EW"]
["Section","All"]
["Factor Type","CETV"]
["Description","CETV factors for women, NPA 65, AP in respect of an election on or before 22 June 2010"]
["Gender","Female"]
["Factor Age/Period Definition","Age last birthday at relevant date"]
["Section Number",0]
["Series Number",222]
["Table Reference","x-222"]
["Table Reference in Guidance","Table CEF65R"]
["Associated Guidance Note","Teachers' Pension Scheme: Final salary sections and career average section\nCash Equivalent Transfer Values (CETVs): Factors and Guidance\nDate: 27 October 2019"]
["Date Factors Issued to Client","2023-05-26"]
["Date Factors Implemented (if known)"]
["Factor Status","Issued"]
[]
[null,{"$f":"HYPERLINK(\"#'Factor List'!A1\",\"Back to Factor List\")","v":"Back to Factor List"}]
[]
[]
["Age","Gross Pension of £1 pa","Surviving Partner's pension of £1 pa"]
[20,11.1,1.36]
[21,11.25,1.38]
[22,11.4,1.4]
[23,11.56,1.42]
[24,11.71,1.44]
[25,11.87,1.47]
[26,12.04,1.49]
[27,12.2,1.51]
[28,12.37,1.53]
[29,12.54,1.55]
[30,12.71,1.57]
[31,12.88,1.59]
[32,13.06,1.61]
[33,13.24,1.63]
[34,13.42,1.65]
[35,13.6,1.67]
[36,13.79,1.69]
[37,13.98,1.71]
[38,14.17,1.73]
[39,14.37,1.75]
[40,14.57,1.77]
[41,14.77,1.79]
[42,14.97,1.8]
[43,15.18,1.82]
[44,15.39,1.84]
[45,15.61,1.85]
[46,15.83,1.87]
[47,16.05,1.89]
[48,16.28,1.9]
[49,16.510000000000002,1.91]
[50,16.739999999999998,1.93]
[51,16.98,1.94]
[52,17.23,1.95]
[53,17.48,1.96]
[54,17.739999999999998,1.97]
[55,18,1.98]
[56,18.27,1.98]
[57,18.55,1.99]
[58,18.829999999999998,1.99]
[59,19.02,1.98]
[60,19.11,1.96]
[61,19.21,1.94]
[62,19.329999999999998,1.92]
[63,19.47,1.89]
[64,19.61,1.86]

{"sheet":"x-224","index":29,"n_rows":40,"n_cols":4,"rows_kept":40,"cut":false,"hidden":false,"merged":[]}
["Government Actuary's Department"]
[{"$f":"IF(title=\"> Enter workbook title here\",\"Enter workbook title in Cover sheet\",title)","v":"TPS (England & Wales) - Consolidated Factor Spreadsheet"}]
[{"$f":"TABLE_FACTOR_TYPE&\" - x-\"&TABLE_SERIES_NUMBER","v":"CETV - x-224"}]
[]
[]
["Data Item","Factor Table Information"]
["Client","TPS_EW"]
["Section","All"]
["Factor Type","CETV"]
["Description","CETV factors for men above their NPA"]
["Gender","Male"]
["Factor Age/Period Definition","Age last birthday at relevant date"]
["Section Number",0]
["Series Number",224]
["Table Reference","x-224"]
["Table Reference in Guidance","Table 503"]
["Associated Guidance Note","Teachers' Pension Scheme: Final salary sections and career average section\nCash Equivalent Transfer Values (CETVs) for ages above normal pension age: Factors and Guidance\nDate: 27 October 2019"]
["Date Factors Issued to Client","2023-05-26"]
["Date Factors Implemented (if known)"]
["Factor Status","Issued"]
[]
[null,{"$f":"HYPERLINK(\"#'Factor List'!A1\",\"Back to Factor List\")","v":"Back to Factor List"}]
[]
[]
["Age","Gross pension of £1 pa","Survivor's pension of £1 pa","Deduction for NI Nodification of £1 pa"]
[60,22.47,1.76,0]
[61,21.84,1.77,0]
[62,21.21,1.78,0]
[63,20.58,1.79,0]
[64,19.95,1.77,0]
[65,19.309999999999999,1.76,0]
[66,18.66,1.76,0]
[67,18.02,1.76,0]
[68,17.37,1.76,0]
[69,16.71,1.71,0]
[70,16.059999999999999,1.65,0]
[71,15.4,1.65,0]
[72,14.74,1.64,0]
[73,14.08,1.63,0]
[74,13.42,1.52,0]

{"sheet":"x-225","index":30,"n_rows":40,"n_cols":4,"rows_kept":40,"cut":false,"hidden":false,"merged":[]}
["Government Actuary's Department"]
[{"$f":"IF(title=\"> Enter workbook title here\",\"Enter workbook title in Cover sheet\",title)","v":"TPS (England & Wales) - Consolidated Factor Spreadsheet"}]
[{"$f":"TABLE_FACTOR_TYPE&\" - x-\"&TABLE_SERIES_NUMBER","v":"CETV - x-225"}]
[]
[]
["Data Item","Factor Table Information"]
["Client","TPS_EW"]
["Section","All"]
["Factor Type","CETV"]
["Description","CETV factors for women above their NPA"]
["Gender","Female"]
["Factor Age/Period Definition","Age last birthday at relevant date"]
["Section Number",0]
["Series Number",225]
["Table Reference","x-225"]
["Table Reference in Guidance","Table 513"]
["Associated Guidance Note","Teachers' Pension Scheme: Final salary sections and career average section\nCash Equivalent Transfer Values (CETVs) for ages above normal pension age: Factors and Guidance\nDate: 27 October 2019"]
["Date Factors Issued to Client","2023-05-26"]
["Date Factors Implemented (if known)"]
["Factor Status","Issued"]
[]
[null,{"$f":"HYPERLINK(\"#'Factor List'!A1\",\"Back to Factor List\")","v":"Back to Factor List"}]
[]
[]
["Age","Gross Pension of £1 pa","Surviving Partner's pension of £1 pa","Deduction for NI Nodification of £1 pa"]
[60,22.47,1.76,0]
[61,21.84,1.77,0]
[62,21.21,1.78,0]
[63,20.58,1.79,0]
[64,19.95,1.77,0]
[65,19.309999999999999,1.76,0]
[66,18.66,1.76,0]
[67,18.02,1.76,0]
[68,17.37,1.76,0]
[69,16.71,1.71,0]
[70,16.059999999999999,1.65,0]
[71,15.4,1.65,0]
[72,14.74,1.64,0]
[73,14.08,1.63,0]
[74,13.42,1.52,0]

{"sheet":"x-226","index":31,"n_rows":29,"n_cols":13,"rows_kept":29,"cut":false,"hidden":false,"merged":[]}
["Government Actuary's Department"]
[{"$f":"IF(title=\"> Enter workbook title here\",\"Enter workbook title in Cover sheet\",title)","v":"TPS (England & Wales) - Consolidated Factor Spreadsheet"}]
[{"$f":"TABLE_FACTOR_TYPE&\" - x-\"&TABLE_SERIES_NUMBER","v":"CETV - x-226"}]
[]
[]
["Data Item","Factor Table Information"]
["Client","TPS_EW"]
["Section","Career Average"]
["Factor Type","CETV"]
["Description","Adjustment factor for CETV where a buy-out election applies"]
["Gender","Unisex"]
["Factor Age/Period Definition","Number of years and months for which the standard reduction has been bought-out"]
["Section Number",0]
["Series Number",226]
["Table Reference","x-226"]
["Table Reference in Guidance","Table AF1"]
["Associated Guidance Note","Teachers' Pension Scheme: Final salary sections and career average section\nCash Equivalent Transfer Values (CETVs): Factors and Guidance\nDate: 27 October 2019"]
["Date Factors Issued to Client","2023-05-26"]
["Date Factors Implemented (if known)"]
["Factor Status","Issued"]
[]
[null,{"$f":"HYPERLINK(\"#'Factor List'!A1\",\"Back to Factor List\")","v":"Back to Factor List"}]
[]
[]
["Years/Months Early",0,1,2,3,4,5,6,7,8,9,10,11]
[0,1,0.998,0.996,0.995,0.99299999999999999,0.99099999999999999,0.98899999999999999,0.98699999999999999,0.98599999999999999,0.98399999999999999,0.98199999999999998,0.98]
[1,0.97799999999999998,0.97699999999999998,0.97499999999999998,0.97399999999999998,0.97299999999999998,0.97099999999999997,0.97,0.96799999999999997,0.96699999999999997,0.96499999999999997,0.96399999999999997,0.96199999999999997]
[2,0.96099999999999997,0.96,0.95899999999999996,0.95799999999999996,0.95599999999999996,0.95499999999999996,0.95399999999999996,0.95299999999999996,0.95199999999999996,0.95099999999999996,0.95,0.94899999999999995]
[3,0.94699999999999995]

{"sheet":"x-231","index":32,"n_rows":70,"n_cols":3,"rows_kept":70,"cut":false,"hidden":false,"merged":[]}
["Government Actuary's Department"]
[{"$f":"IF(title=\"> Enter workbook title here\",\"Enter workbook title in Cover sheet\",title)","v":"TPS (England & Wales) - Consolidated Factor Spreadsheet"}]
[{"$f":"TABLE_FACTOR_TYPE&\" - x-\"&TABLE_SERIES_NUMBER","v":"TV In (non-club) - x-231"}]
[]
[]
["Data Item","Factor Table Information"]
["Client","TPS_EW"]
["Section","Career Average"]
["Factor Type","TV In (non-club)"]
["Description","Factors for non-Club incoming transfers - men, NPA 65 (CARE)"]
["Gender","Male"]
["Factor Age/Period Definition","Age last birthday at relevant date"]
["Section Number",0]
["Series Number",231]
["Table Reference","x-231"]
["Table Reference in Guidance","Table CA_TVIN65M"]
["Associated Guidance Note","Teachers' Pension Scheme: Final salary section and career average section\nNon-Club incoming transfers: Factors and guidance\nDate: 27 October 2019"]
["Date Factors Issued to Client","2023-06-30"]
["Date Factors Implemented (if known)"]
["Factor Status","Issued"]
[]
[null,{"$f":"HYPERLINK(\"#'Factor List'!A1\",\"Back to Factor List\")","v":"Back to Factor List"}]
[]
[]
["Age","Gross pension of £1 pa ","Survivor's pension of £1 pa"]
[20,20.25,2.15]
[21,20.239999999999998,2.15]
[22,20.22,2.15]
[23,20.2,2.15]
[24,20.190000000000001,2.16]
[25,20.170000000000002,2.16]
[26,20.16,2.16]
[27,20.14,2.16]
[28,20.12,2.16]
[29,20.100000000000001,2.16]
[30,20.09,2.16]
[31,20.07,2.16]
[32,20.05,2.16]
[33,20.04,2.16]
[34,20.02,2.16]
[35,20,2.16]
[36,19.98,2.16]
[37,19.97,2.16]
[38,19.95,2.15]
[39,19.93,2.15]
[40,19.91,2.15]
[41,19.899999999999999,2.14]
[42,19.88,2.14]
[43,19.86,2.13]
[44,19.84,2.13]
[45,19.829999999999998,2.12]
[46,19.809999999999999,2.12]
[47,19.79,2.11]
[48,19.77,2.1]
[49,19.760000000000002,2.1]
[50,19.739999999999998,2.09]
[51,19.72,2.08]
[52,19.7,2.0699999999999998]
[53,19.68,2.0499999999999998]
[54,19.670000000000002,2.04]
[55,19.649999999999999,2.0299999999999998]
[56,19.64,2.0099999999999998]
[57,19.63,2]
[58,19.62,1.98]
[59,19.62,1.96]
[60,19.62,1.94]
[61,19.62,1.92]
[62,19.63,1.9]
[63,19.649999999999999,1.88]
[64,19.670000000000002,1.86]

{"sheet":"x-232","index":33,"n_rows":70,"n_cols":3,"rows_kept":70,"cut":false,"hidden":false,"merged":[]}
["Government Actuary's Department"]
[{"$f":"IF(title=\"> Enter workbook title here\",\"Enter workbook title in Cover sheet\",title)","v":"TPS (England & Wales) - Consolidated Factor Spreadsheet"}]
[{"$f":"TABLE_FACTOR_TYPE&\" - x-\"&TABLE_SERIES_NUMBER","v":"TV In (non-club) - x-232"}]
[]
[]
["Data Item","Factor Table Information"]
["Client","TPS_EW"]
["Section","Career Average"]
["Factor Type","TV In (non-club)"]
["Description","Factors for non-Club incoming transfers - women, NPA 65 (CARE)"]
["Gender","Female"]
["Factor Age/Period Definition","Age last birthday at relevant date"]
["Section Number",0]
["Series Number",232]
["Table Reference","x-232"]
["Table Reference in Guidance","Table CA_TVIN65F"]
["Associated Guidance Note","Teachers' Pension Scheme: Final salary section and career average section\nNon-Club incoming transfers: Factors and guidance\nDate: 27 October 2019"]
["Date Factors Issued to Client","2023-06-30"]
["Date Factors Implemented (if known)"]
["Factor Status","Issued"]
[]
[null,{"$f":"HYPERLINK(\"#'Factor List'!A1\",\"Back to Factor List\")","v":"Back to Factor List"}]
[]
[]
["Age","Gross pension of £1 pa","Survivor's pension of £1 pa"]
[20,20.25,2.15]
[21,20.239999999999998,2.15]
[22,20.22,2.15]
[23,20.2,2.15]
[24,20.190000000000001,2.16]
[25,20.170000000000002,2.16]
[26,20.16,2.16]
[27,20.14,2.16]
[28,20.12,2.16]
[29,20.100000000000001,2.16]
[30,20.09,2.16]
[31,20.07,2.16]
[32,20.05,2.16]
[33,20.04,2.16]
[34,20.02,2.16]
[35,20,2.16]
[36,19.98,2.16]
[37,19.97,2.16]
[38,19.95,2.15]
[39,19.93,2.15]
[40,19.91,2.15]
[41,19.899999999999999,2.14]
[42,19.88,2.14]
[43,19.86,2.13]
[44,19.84,2.13]
[45,19.829999999999998,2.12]
[46,19.809999999999999,2.12]
[47,19.79,2.11]
[48,19.77,2.1]
[49,19.760000000000002,2.1]
[50,19.739999999999998,2.09]
[51,19.72,2.08]
[52,19.7,2.0699999999999998]
[53,19.68,2.0499999999999998]
[54,19.670000000000002,2.04]
[55,19.649999999999999,2.0299999999999998]
[56,19.64,2.0099999999999998]
[57,19.63,2]
[58,19.62,1.98]
[59,19.62,1.96]
[60,19.62,1.94]
[61,19.62,1.92]
[62,19.63,1.9]
[63,19.649999999999999,1.88]
[64,19.670000000000002,1.86]

{"sheet":"x-233","index":34,"n_rows":71,"n_cols":3,"rows_kept":71,"cut":false,"hidden":false,"merged":[]}
["Government Actuary's Department"]
[{"$f":"IF(title=\"> Enter workbook title here\",\"Enter workbook title in Cover sheet\",title)","v":"TPS (England & Wales) - Consolidated Factor Spreadsheet"}]
[{"$f":"TABLE_FACTOR_TYPE&\" - x-\"&TABLE_SERIES_NUMBER","v":"TV In (non-club) - x-233"}]
[]
[]
["Data Item","Factor Table Information"]
["Client","TPS_EW"]
["Section","Career Average"]
["Factor Type","TV In (non-club)"]
["Description","Factors for non-Club incoming transfers - men, NPA 66 (CARE)"]
["Gender","Male"]
["Factor Age/Period Definition","Age last birthday at relevant date"]
["Section Number",0]
["Series Number",233]
["Table Reference","x-233"]
["Table Reference in Guidance","Table CA_TVIN66M"]
["Associated Guidance Note","Teachers' Pension Scheme: Final salary section and career average section\nNon-Club incoming transfers: Factors and guidance\nDate: 27 October 2019"]
["Date Factors Issued to Client","2023-06-30"]
["Date Factors Implemented (if known)"]
["Factor Status","Issued"]
[]
[null,{"$f":"HYPERLINK(\"#'Factor List'!A1\",\"Back to Factor List\")","v":"Back to Factor List"}]
[]
[]
["Age","Gross pension of £1 pa","Survivor's pension of £1 pa"]
[20,19.68,2.1800000000000002]
[21,19.670000000000002,2.1800000000000002]
[22,19.649999999999999,2.19]
[23,19.63,2.19]
[24,19.62,2.19]
[25,19.600000000000001,2.19]
[26,19.579999999999998,2.19]
[27,19.559999999999999,2.19]
[28,19.55,2.19]
[29,19.53,2.19]
[30,19.510000000000002,2.19]
[31,19.489999999999998,2.19]
[32,19.47,2.19]
[33,19.45,2.19]
[34,19.440000000000001,2.19]
[35,19.420000000000002,2.19]
[36,19.399999999999999,2.19]
[37,19.38,2.19]
[38,19.36,2.1800000000000002]
[39,19.34,2.1800000000000002]
[40,19.329999999999998,2.1800000000000002]
[41,19.309999999999999,2.17]
[42,19.29,2.17]
[43,19.27,2.16]
[44,19.25,2.16]
[45,19.23,2.15]
[46,19.21,2.15]
[47,19.190000000000001,2.14]
[48,19.170000000000002,2.13]
[49,19.149999999999999,2.12]
[50,19.13,2.12]
[51,19.11,2.11]
[52,19.09,2.09]
[53,19.07,2.08]
[54,19.05,2.0699999999999998]
[55,19.04,2.06]
[56,19.02,2.04]
[57,19.010000000000002,2.0299999999999998]
[58,19,2.0099999999999998]
[59,18.989999999999998,1.99]
[60,18.98,1.97]
[61,18.98,1.95]
[62,18.989999999999998,1.93]
[63,19,1.91]
[64,19.010000000000002,1.88]
[65,19.04,1.86]

{"sheet":"x-234","index":35,"n_rows":71,"n_cols":3,"rows_kept":71,"cut":false,"hidden":false,"merged":[]}
["Government Actuary's Department"]
[{"$f":"IF(title=\"> Enter workbook title here\",\"Enter workbook title in Cover sheet\",title)","v":"TPS (England & Wales) - Consolidated Factor Spreadsheet"}]
[{"$f":"TABLE_FACTOR_TYPE&\" - x-\"&TABLE_SERIES_NUMBER","v":"TV In (non-club) - x-234"}]
[]
[]
["Data Item","Factor Table Information"]
["Client","TPS_EW"]
["Section","Career Average"]
["Factor Type","TV In (non-club)"]
["Description","Factors for non-Club incoming transfers - women, NPA 66 (CARE)"]
["Gender","Female"]
["Factor Age/Period Definition","Age last birthday at relevant date"]
["Section Number",0]
["Series Number",234]
["Table Reference","x-234"]
["Table Reference in Guidance","Table CA_TVIN66F"]
["Associated Guidance Note","Teachers' Pension Scheme: Final salary section and career average section\nNon-Club incoming transfers: Factors and guidance\nDate: 27 October 2019"]
["Date Factors Issued to Client","2023-06-30"]
["Date Factors Implemented (if known)"]
["Factor Status","Issued"]
[]
[null,{"$f":"HYPERLINK(\"#'Factor List'!A1\",\"Back to Factor List\")","v":"Back to Factor List"}]
[]
[]
["Age","Gross pension of £1 pa","Survivor's pension of £1 pa"]
[20,19.68,2.1800000000000002]
[21,19.670000000000002,2.1800000000000002]
[22,19.649999999999999,2.19]
[23,19.63,2.19]
[24,19.62,2.19]
[25,19.600000000000001,2.19]
[26,19.579999999999998,2.19]
[27,19.559999999999999,2.19]
[28,19.55,2.19]
[29,19.53,2.19]
[30,19.510000000000002,2.19]
[31,19.489999999999998,2.19]
[32,19.47,2.19]
[33,19.45,2.19]
[34,19.440000000000001,2.19]
[35,19.420000000000002,2.19]
[36,19.399999999999999,2.19]
[37,19.38,2.19]
[38,19.36,2.1800000000000002]
[39,19.34,2.1800000000000002]
[40,19.329999999999998,2.1800000000000002]
[41,19.309999999999999,2.17]
[42,19.29,2.17]
[43,19.27,2.16]
[44,19.25,2.16]
[45,19.23,2.15]
[46,19.21,2.15]
[47,19.190000000000001,2.14]
[48,19.170000000000002,2.13]
[49,19.149999999999999,2.12]
[50,19.13,2.12]
[51,19.11,2.11]
[52,19.09,2.09]
[53,19.07,2.08]
[54,19.05,2.0699999999999998]
[55,19.04,2.06]
[56,19.02,2.04]
[57,19.010000000000002,2.0299999999999998]
[58,19,2.0099999999999998]
[59,18.989999999999998,1.99]
[60,18.98,1.97]
[61,18.98,1.95]
[62,18.989999999999998,1.93]
[63,19,1.91]
[64,19.010000000000002,1.88]
[65,19.04,1.86]

{"sheet":"x-235","index":36,"n_rows":72,"n_cols":3,"rows_kept":72,"cut":false,"hidden":false,"merged":[]}
["Government Actuary's Department"]
[{"$f":"IF(title=\"> Enter workbook title here\",\"Enter workbook title in Cover sheet\",title)","v":"TPS (England & Wales) - Consolidated Factor Spreadsheet"}]
[{"$f":"TABLE_FACTOR_TYPE&\" - x-\"&TABLE_SERIES_NUMBER","v":"TV In (non-club) - x-235"}]
[]
[]
["Data Item","Factor Table Information"]
["Client","TPS_EW"]
["Section","Career Average"]
["Factor Type","TV In (non-club)"]
["Description","Factors for non-Club incoming transfers - men, NPA 67 (CARE)"]
["Gender","Male"]
["Factor Age/Period Definition","Age last birthday at relevant date"]
["Section Number",0]
["Series Number",235]
["Table Reference","x-235"]
["Table Reference in Guidance","Table CA_TVIN67M"]
["Associated Guidance Note","Teachers' Pension Scheme: Final salary section and career average section\nNon-Club incoming transfers: Factors and guidance\nDate: 27 October 2019"]
["Date Factors Issued to Client","2023-06-30"]
["Date Factors Implemented (if known)"]
["Factor Status","Issued"]
[]
[null,{"$f":"HYPERLINK(\"#'Factor List'!A1\",\"Back to Factor List\")","v":"Back to Factor List"}]
[]
[]
["Age","Gross pension of £1 pa","Survivor's pension of £1 pa"]
[20,19.11,2.21]
[21,19.100000000000001,2.2200000000000002]
[22,19.079999999999998,2.2200000000000002]
[23,19.059999999999999,2.2200000000000002]
[24,19.04,2.2200000000000002]
[25,19.02,2.2200000000000002]
[26,19.010000000000002,2.2200000000000002]
[27,18.989999999999998,2.2200000000000002]
[28,18.97,2.2200000000000002]
[29,18.95,2.2200000000000002]
[30,18.93,2.2200000000000002]
[31,18.91,2.2200000000000002]
[32,18.89,2.2200000000000002]
[33,18.87,2.2200000000000002]
[34,18.850000000000001,2.2200000000000002]
[35,18.829999999999998,2.2200000000000002]
[36,18.82,2.2200000000000002]
[37,18.8,2.2200000000000002]
[38,18.78,2.21]
[39,18.760000000000002,2.21]
[40,18.739999999999998,2.21]
[41,18.72,2.2000000000000002]
[42,18.7,2.2000000000000002]
[43,18.68,2.19]
[44,18.66,2.19]
[45,18.64,2.1800000000000002]
[46,18.62,2.1800000000000002]
[47,18.600000000000001,2.17]
[48,18.579999999999998,2.16]
[49,18.55,2.15]
[50,18.53,2.14]
[51,18.510000000000002,2.13]
[52,18.489999999999998,2.12]
[53,18.46,2.11]
[54,18.440000000000001,2.1]
[55,18.420000000000002,2.08]
[56,18.399999999999999,2.0699999999999998]
[57,18.38,2.0499999999999998]
[58,18.37,2.04]
[59,18.36,2.02]
[60,18.350000000000001,2]
[61,18.34,1.98]
[62,18.34,1.96]
[63,18.350000000000001,1.94]
[64,18.36,1.91]
[65,18.38,1.89]
[66,18.399999999999999,1.86]

{"sheet":"x-236","index":37,"n_rows":72,"n_cols":3,"rows_kept":72,"cut":false,"hidden":false,"merged":[]}
["Government Actuary's Department"]
[{"$f":"IF(title=\"> Enter workbook title here\",\"Enter workbook title in Cover sheet\",title)","v":"TPS (England & Wales) - Consolidated Factor Spreadsheet"}]
[{"$f":"TABLE_FACTOR_TYPE&\" - x-\"&TABLE_SERIES_NUMBER","v":"TV In (non-club) - x-236"}]
[]
[]
["Data Item","Factor Table Information"]
["Client","TPS_EW"]
["Section","Career Average"]
["Factor Type","TV In (non-club)"]
["Description","Factors for non-Club incoming transfers - women, NPA 67 (CARE)"]
["Gender","Female"]
["Factor Age/Period Definition","Age last birthday at relevant date"]
["Section Number",0]
["Series Number",236]
["Table Reference","x-236"]
["Table Reference in Guidance","Table CA_TVIN67F"]
["Associated Guidance Note","Teachers' Pension Scheme: Final salary section and career average section\nNon-Club incoming transfers: Factors and guidance\nDate: 27 October 2019"]
["Date Factors Issued to Client","2023-06-30"]
["Date Factors Implemented (if known)"]
["Factor Status","Issued"]
[]
[null,{"$f":"HYPERLINK(\"#'Factor List'!A1\",\"Back to Factor List\")","v":"Back to Factor List"}]
[]
[]
["Age","Gross pension of £1 pa","Survivor's pension of £1 pa"]
[20,19.11,2.21]
[21,19.100000000000001,2.2200000000000002]
[22,19.079999999999998,2.2200000000000002]
[23,19.059999999999999,2.2200000000000002]
[24,19.04,2.2200000000000002]
[25,19.02,2.2200000000000002]
[26,19.010000000000002,2.2200000000000002]
[27,18.989999999999998,2.2200000000000002]
[28,18.97,2.2200000000000002]
[29,18.95,2.2200000000000002]
[30,18.93,2.2200000000000002]
[31,18.91,2.2200000000000002]
[32,18.89,2.2200000000000002]
[33,18.87,2.2200000000000002]
[34,18.850000000000001,2.2200000000000002]
[35,18.829999999999998,2.2200000000000002]
[36,18.82,2.2200000000000002]
[37,18.8,2.2200000000000002]
[38,18.78,2.21]
[39,18.760000000000002,2.21]
[40,18.739999999999998,2.21]
[41,18.72,2.2000000000000002]
[42,18.7,2.2000000000000002]
[43,18.68,2.19]
[44,18.66,2.19]
[45,18.64,2.1800000000000002]
[46,18.62,2.1800000000000002]
[47,18.600000000000001,2.17]
[48,18.579999999999998,2.16]
[49,18.55,2.15]
[50,18.53,2.14]
[51,18.510000000000002,2.13]
[52,18.489999999999998,2.12]
[53,18.46,2.11]
[54,18.440000000000001,2.1]
[55,18.420000000000002,2.08]
[56,18.399999999999999,2.0699999999999998]
[57,18.38,2.0499999999999998]
[58,18.37,2.04]
[59,18.36,2.02]
[60,18.350000000000001,2]
[61,18.34,1.98]
[62,18.34,1.96]
[63,18.350000000000001,1.94]
[64,18.36,1.91]
[65,18.38,1.89]
[66,18.399999999999999,1.86]

{"sheet":"x-237","index":38,"n_rows":73,"n_cols":3,"rows_kept":73,"cut":false,"hidden":false,"merged":[]}
["Government Actuary's Department"]
[{"$f":"IF(title=\"> Enter workbook title here\",\"Enter workbook title in Cover sheet\",title)","v":"TPS (England & Wales) - Consolidated Factor Spreadsheet"}]
[{"$f":"TABLE_FACTOR_TYPE&\" - x-\"&TABLE_SERIES_NUMBER","v":"TV In (non-club) - x-237"}]
[]
[]
["Data Item","Factor Table Information"]
["Client","TPS_EW"]
["Section","Career Average"]
["Factor Type","TV In (non-club)"]
["Description","Factors for non-Club incoming transfers - men, NPA 68 (CARE)"]
["Gender","Male"]
["Factor Age/Period Definition","Age last birthday at relevant date"]
["Section Number",0]
["Series Number",237]
["Table Reference","x-237"]
["Table Reference in Guidance","Table CA_TVIN68M"]
["Associated Guidance Note","Teachers' Pension Scheme: Final salary section and career average section\nNon-Club incoming transfers: Factors and guidance\nDate: 27 October 2019"]
["Date Factors Issued to Client","2023-06-30"]
["Date Factors Implemented (if known)"]
["Factor Status","Issued"]
[]
[null,{"$f":"HYPERLINK(\"#'Factor List'!A1\",\"Back to Factor List\")","v":"Back to Factor List"}]
[]
[]
["Age","Gross pension of £1 pa","Survivor's pension of £1 pa"]
[20,18.54,2.25]
[21,18.52,2.25]
[22,18.510000000000002,2.25]
[23,18.489999999999998,2.25]
[24,18.47,2.25]
[25,18.45,2.25]
[26,18.43,2.25]
[27,18.41,2.25]
[28,18.39,2.25]
[29,18.37,2.25]
[30,18.350000000000001,2.25]
[31,18.329999999999998,2.25]
[32,18.309999999999999,2.25]
[33,18.29,2.25]
[34,18.27,2.25]
[35,18.25,2.25]
[36,18.23,2.25]
[37,18.21,2.2400000000000002]
[38,18.190000000000001,2.2400000000000002]
[39,18.170000000000002,2.2400000000000002]
[40,18.149999999999999,2.23]
[41,18.13,2.23]
[42,18.11,2.23]
[43,18.09,2.2200000000000002]
[44,18.07,2.2200000000000002]
[45,18.05,2.21]
[46,18.02,2.2000000000000002]
[47,18,2.2000000000000002]
[48,17.98,2.19]
[49,17.96,2.1800000000000002]
[50,17.93,2.17]
[51,17.91,2.16]
[52,17.88,2.15]
[53,17.86,2.14]
[54,17.829999999999998,2.13]
[55,17.809999999999999,2.11]
[56,17.78,2.1]
[57,17.760000000000002,2.08]
[58,17.739999999999998,2.06]
[59,17.73,2.0499999999999998]
[60,17.72,2.0299999999999998]
[61,17.71,2.0099999999999998]
[62,17.7,1.98]
[63,17.7,1.96]
[64,17.7,1.94]
[65,17.72,1.91]
[66,17.73,1.89]
[67,17.760000000000002,1.86]

{"sheet":"x-238","index":39,"n_rows":73,"n_cols":3,"rows_kept":73,"cut":false,"hidden":false,"merged":[]}
["Government Actuary's Department"]
[{"$f":"IF(title=\"> Enter workbook title here\",\"Enter workbook title in Cover sheet\",title)","v":"TPS (England & Wales) - Consolidated Factor Spreadsheet"}]
[{"$f":"TABLE_FACTOR_TYPE&\" - x-\"&TABLE_SERIES_NUMBER","v":"TV In (non-club) - x-238"}]
[]
[]
["Data Item","Factor Table Information"]
["Client","TPS_EW"]
["Section","Career Average"]
["Factor Type","TV In (non-club)"]
["Description","Factors for non-Club incoming transfers - women, NPA 68 (CARE)"]
["Gender","Female"]
["Factor Age/Period Definition","Age last birthday at relevant date"]
["Section Number",0]
["Series Number",238]
["Table Reference","x-238"]
["Table Reference in Guidance","Table CA_TVIN68F"]
["Associated Guidance Note","Teachers' Pension Scheme: Final salary section and career average section\nNon-Club incoming transfers: Factors and guidance\nDate: 27 October 2019"]
["Date Factors Issued to Client","2023-06-30"]
["Date Factors Implemented (if known)"]
["Factor Status","Issued"]
[]
[null,{"$f":"HYPERLINK(\"#'Factor List'!A1\",\"Back to Factor List\")","v":"Back to Factor List"}]
[]
[]
["Age","Gross pension of £1 pa","Survivor's pension of £1 pa"]
[20,18.54,2.25]
[21,18.52,2.25]
[22,18.510000000000002,2.25]
[23,18.489999999999998,2.25]
[24,18.47,2.25]
[25,18.45,2.25]
[26,18.43,2.25]
[27,18.41,2.25]
[28,18.39,2.25]
[29,18.37,2.25]
[30,18.350000000000001,2.25]
[31,18.329999999999998,2.25]
[32,18.309999999999999,2.25]
[33,18.29,2.25]
[34,18.27,2.25]
[35,18.25,2.25]
[36,18.23,2.25]
[37,18.21,2.2400000000000002]
[38,18.190000000000001,2.2400000000000002]
[39,18.170000000000002,2.2400000000000002]
[40,18.149999999999999,2.23]
[41,18.13,2.23]
[42,18.11,2.23]
[43,18.09,2.2200000000000002]
[44,18.07,2.2200000000000002]
[45,18.05,2.21]
[46,18.02,2.2000000000000002]
[47,18,2.2000000000000002]
[48,17.98,2.19]
[49,17.96,2.1800000000000002]
[50,17.93,2.17]
[51,17.91,2.16]
[52,17.88,2.15]
[53,17.86,2.14]
[54,17.829999999999998,2.13]
[55,17.809999999999999,2.11]
[56,17.78,2.1]
[57,17.760000000000002,2.08]
[58,17.739999999999998,2.06]
[59,17.73,2.0499999999999998]
[60,17.72,2.0299999999999998]
[61,17.71,2.0099999999999998]
[62,17.7,1.98]
[63,17.7,1.96]
[64,17.7,1.94]
[65,17.72,1.91]
[66,17.73,1.89]
[67,17.760000000000002,1.86]

{"sheet":"x-239","index":40,"n_rows":40,"n_cols":4,"rows_kept":40,"cut":false,"hidden":false,"merged":[]}
["Government Actuary's Department"]
[{"$f":"IF(title=\"> Enter workbook title here\",\"Enter workbook title in Cover sheet\",title)","v":"TPS (England & Wales) - Consolidated Factor Spreadsheet"}]
[{"$f":"TABLE_FACTOR_TYPE&\" - x-\"&TABLE_SERIES_NUMBER","v":"TV In (non-club) - x-239"}]
[]
[]
["Data Item","Factor Table Information"]
["Client","TPS_EW"]
["Section","Career Average"]
["Factor Type","TV In (non-club)"]
["Description","Factors for over NPA non-Club incoming transfers - men"]
["Gender","Male"]
["Factor Age/Period Definition","Age last birthday at relevant date"]
["Section Number",0]
["Series Number",239]
["Table Reference","x-239"]
["Table Reference in Guidance","Table 603"]
["Associated Guidance Note","Teachers' Pension Scheme: Final salary section and career average section\nOver NPA non-Club incoming transfers: Factors and guidance\nDate: 27 October 2019"]
["Date Factors Issued to Client","2023-06-30"]
["Date Factors Implemented (if known)"]
["Factor Status","Issued"]
[]
[null,{"$f":"HYPERLINK(\"#'Factor List'!A1\",\"Back to Factor List\")","v":"Back to Factor List"}]
[]
[]
["Age","Gross pension of £1 pa","Lump sum of £1 pa","Survivor's pension of £1 pa"]
[60,22.47,1,1.76]
[61,21.84,1,1.77]
[62,21.21,1,1.78]
[63,20.58,1,1.79]
[64,19.95,1,1.77]
[65,19.309999999999999,1,1.76]
[66,18.66,1,1.76]
[67,18.02,1,1.76]
[68,17.37,1,1.76]
[69,16.71,1,1.71]
[70,16.059999999999999,1,1.65]
[71,15.4,1,1.65]
[72,14.74,1,1.64]
[73,14.08,1,1.63]
[74,13.42,1,1.52]

{"sheet":"x-240","index":41,"n_rows":40,"n_cols":4,"rows_kept":40,"cut":false,"hidden":false,"merged":[]}
["Government Actuary's Department"]
[{"$f":"IF(title=\"> Enter workbook title here\",\"Enter workbook title in Cover sheet\",title)","v":"TPS (England & Wales) - Consolidated Factor Spreadsheet"}]
[{"$f":"TABLE_FACTOR_TYPE&\" - x-\"&TABLE_SERIES_NUMBER","v":"TV In (non-club) - x-240"}]
[]
[]
["Data Item","Factor Table Information"]
["Client","TPS_EW"]
["Section","Career Average"]
["Factor Type","TV In (non-club)"]
["Description","Factors for over NPA non-Club incoming transfers - women"]
["Gender","Female"]
["Factor Age/Period Definition","Age last birthday at relevant date"]
["Section Number",0]
["Series Number",240]
["Table Reference","x-240"]
["Table Reference in Guidance","Table 613"]
["Associated Guidance Note","Teachers' Pension Scheme: Final salary section and career average section\nOver NPA non-Club incoming transfers: Factors and guidance\nDate: 27 October 2019"]
["Date Factors Issued to Client","2023-06-30"]
["Date Factors Implemented (if known)"]
["Factor Status","Issued"]
[]
[null,{"$f":"HYPERLINK(\"#'Factor List'!A1\",\"Back to Factor List\")","v":"Back to Factor List"}]
[]
[]
["Age","Gross pension of £1 pa","Lump sum of £1 pa","Survivor's pension of £1 pa"]
[60,22.47,1,1.76]
[61,21.84,1,1.77]
[62,21.21,1,1.78]
[63,20.58,1,1.79]
[64,19.95,1,1.77]
[65,19.309999999999999,1,1.76]
[66,18.66,1,1.76]
[67,18.02,1,1.76]
[68,17.37,1,1.76]
[69,16.71,1,1.71]
[70,16.059999999999999,1,1.65]
[71,15.4,1,1.65]
[72,14.74,1,1.64]
[73,14.08,1,1.63]
[74,13.42,1,1.52]

{"sheet":"x-301","index":42,"n_rows":66,"n_cols":5,"rows_kept":66,"cut":false,"hidden":false,"merged":[]}
["Government Actuary's Department"]
[{"$f":"IF(title=\"> Enter workbook title here\",\"Enter workbook title in Cover sheet\",title)","v":"TPS (England & Wales) - Consolidated Factor Spreadsheet"}]
[{"$f":"TABLE_FACTOR_TYPE&\" - x-\"&TABLE_SERIES_NUMBER","v":"Pensioner Cash Equivalent - x-301"}]
[]
[]
["Data Item","Factor Table Information"]
["Client","TPS_EW"]
["Section","All"]
["Factor Type","Pensioner Cash Equivalent"]
["Description","TPS, Factors to calculate pensioner cash equivalents on divorce - retirement not on grounds of ill health"]
["Gender","Male"]
["Factor Age/Period Definition","Age last birthday at relevant date"]
["Section Number",0]
["Series Number",301]
["Table Reference","x-301"]
["Table Reference in Guidance","Table 303"]
["Associated Guidance Note","Teachers' Pension Scheme: Final salary sections and career average section\nPensioner cash equivalents on divorce\nDate: 12 May 2021"]
["Date Factors Issued to Client","2023-05-26"]
["Date Factors Implemented (if known)"]
["Factor Status","Issued"]
[]
[null,{"$f":"HYPERLINK(\"#'Factor List'!A1\",\"Back to Factor List\")","v":"Back to Factor List"}]
[]
[]
["Age","Member's Pension of £1 pa","Survivor's Pension of £1 pa","Deduction for GMP of £1 pa","Deduction for NI Modification of £1 pa"]
[55,25.44,1.7,null,0]
[56,24.86,1.72,null,0]
[57,24.27,1.73,null,0]
[58,23.68,1.74,null,0]
[59,23.08,1.75,null,0]
[60,22.47,1.76,null,0]
[61,21.84,1.77,null,0]
[62,21.21,1.78,null,0]
[63,20.58,1.79,null,0]
[64,19.95,1.77,null,0]
[65,19.309999999999999,1.76]
[66,18.66,1.76]
[67,18.02,1.76]
[68,17.37,1.76]
[69,16.71,1.71,3.31]
[70,16.059999999999999,1.65,3.09]
[71,15.4,1.65,2.88]
[72,14.74,1.64,2.67]
[73,14.08,1.63,2.4700000000000002]
[74,13.42,1.52,2.27]
[75,12.77,1.41,2.08]
[76,12.12,1.4,1.9]
[77,11.47,1.38,1.74]
[78,10.84,1.36,1.58]
[79,10.210000000000001,1.22,1.42]
[80,9.6,1.07,1.26]
[81,9,1.05,1.1399999999999999]
[82,8.42,1.02,1.02]
[83,7.86,0.99,0.91]
[84,7.32,0.85,0.79]
[85,6.8,0.71,0.69]
[86,6.31,0.68,0.61]
[87,5.84,0.65,0.54]
[88,5.41,0.62,0.47]
[89,5,0.49,0.4]
[90,4.6100000000000003,0.37,0.33]
[91,4.26,0.35,0.28999999999999998]
[92,3.94,0.33,0.25]
[93,3.64,0.31,0.22]
[94,3.38,0.28999999999999998,0.19]
[95,3.13,0.27,0.17]

{"sheet":"x-302","index":43,"n_rows":66,"n_cols":5,"rows_kept":66,"cut":false,"hidden":false,"merged":[]}
["Government Actuary's Department"]
[{"$f":"IF(title=\"> Enter workbook title here\",\"Enter workbook title in Cover sheet\",title)","v":"TPS (England & Wales) - Consolidated Factor Spreadsheet"}]
[{"$f":"TABLE_FACTOR_TYPE&\" - x-\"&TABLE_SERIES_NUMBER","v":"Pensioner Cash Equivalent - x-302"}]
[]
[]
["Data Item","Factor Table Information"]
["Client","TPS_EW"]
["Section","All"]
["Factor Type","Pensioner Cash Equivalent"]
["Description","TPS, Factors to calculate pensioner cash equivalents on divorce - retirement not on grounds of ill health"]
["Gender","Female"]
["Factor Age/Period Definition","Age last birthday at relevant date"]
["Section Number",0]
["Series Number",302]
["Table Reference","x-302"]
["Table Reference in Guidance","Table 313"]
["Associated Guidance Note","Teachers' Pension Scheme: Final salary sections and career average section\nPensioner cash equivalents on divorce\nDate: 12 May 2021"]
["Date Factors Issued to Client","2023-05-26"]
["Date Factors Implemented (if known)"]
["Factor Status","Issued"]
[]
[null,{"$f":"HYPERLINK(\"#'Factor List'!A1\",\"Back to Factor List\")","v":"Back to Factor List"}]
[]
[]
["Age","Member's Pension of £1 pa","Survivor's Pension of £1 pa","Deduction for GMP of £1 pa","Deduction for NI Modification of £1 pa"]
[55,25.44,1.7,null,0]
[56,24.86,1.72,null,0]
[57,24.27,1.73,null,0]
[58,23.68,1.74,null,0]
[59,23.08,1.75,null,0]
[60,22.47,1.76,null,0]
[61,21.84,1.77,null,0]
[62,21.21,1.78,null,0]
[63,20.58,1.79,null,0]
[64,19.95,1.77,null,0]
[65,19.309999999999999,1.76]
[66,18.66,1.76]
[67,18.02,1.76]
[68,17.37,1.76]
[69,16.71,1.71,3.15]
[70,16.059999999999999,1.65,2.93]
[71,15.4,1.65,2.72]
[72,14.74,1.64,2.5099999999999998]
[73,14.08,1.63,2.3199999999999998]
[74,13.42,1.52,2.13]
[75,12.77,1.41,1.95]
[76,12.12,1.4,1.78]
[77,11.47,1.38,1.61]
[78,10.84,1.36,1.46]
[79,10.210000000000001,1.22,1.31]
[80,9.6,1.07,1.18]
[81,9,1.05,1.05]
[82,8.42,1.02,0.94]
[83,7.86,0.99,0.83]
[84,7.32,0.85,0.73]
[85,6.8,0.71,0.64]
[86,6.31,0.68,0.56999999999999995]
[87,5.84,0.65,0.49]
[88,5.41,0.62,0.43]
[89,5,0.49,0.37]
[90,4.6100000000000003,0.37,0.33]
[91,4.26,0.35,0.28000000000000003]
[92,3.94,0.33,0.25]
[93,3.64,0.31,0.21]
[94,3.38,0.28999999999999998,0.19]
[95,3.13,0.27,0.16]

{"sheet":"x-303","index":44,"n_rows":101,"n_cols":5,"rows_kept":101,"cut":false,"hidden":false,"merged":[]}
["Government Actuary's Department"]
[{"$f":"IF(title=\"> Enter workbook title here\",\"Enter workbook title in Cover sheet\",title)","v":"TPS (England & Wales) - Consolidated Factor Spreadsheet"}]
[{"$f":"TABLE_FACTOR_TYPE&\" - x-\"&TABLE_SERIES_NUMBER","v":"Pensioner Cash Equivalent - x-303"}]
[]
[]
["Data Item","Factor Table Information"]
["Client","TPS_EW"]
["Section","All"]
["Factor Type","Pensioner Cash Equivalent"]
["Description","TPS, Factors to calculate pensioner cash equivalents on divorce - retirement on grounds of ill health - ages 20 to 95"]
["Gender","Male"]
["Factor Age/Period Definition","Age last birthday at relevant date"]
["Section Number",0]
["Series Number",303]
["Table Reference","x-303"]
["Table Reference in Guidance","Table 323"]
["Associated Guidance Note","Teachers' Pension Scheme: Final salary sections and career average section\nPensioner cash equivalents on divorce\nDate: 12 May 2021"]
["Date Factors Issued to Client","2023-05-26"]
["Date Factors Implemented (if known)"]
["Factor Status","Issued"]
[]
[null,{"$f":"HYPERLINK(\"#'Factor List'!A1\",\"Back to Factor List\")","v":"Back to Factor List"}]
[]
[]
["Age","Member's Pension of £1 pa","Survivor's Pension of £1 pa","Deduction for GMP of £1 pa","Deduction for NI Modification of £1 pa"]
[20,33.49,5.2,null,0]
[21,33.24,5.16,null,0]
[22,33,5.1100000000000003,null,0]
[23,32.75,5.0599999999999996,null,0]
[24,32.5,5.01,null,0]
[25,32.25,4.96,null,0]
[26,32,4.91,null,0]
[27,31.74,4.8499999999999996,null,0]
[28,31.48,4.79,null,0]
[29,31.23,4.72,null,0]
[30,30.98,4.6500000000000004,null,0]
[31,30.73,4.58,null,0]
[32,30.48,4.51,null,0]
[33,30.22,4.43,null,0]
[34,29.97,4.3499999999999996,null,0]
[35,29.71,4.26,null,0]
[36,29.45,4.18,null,0]
[37,29.18,4.0999999999999996,null,0]
[38,28.9,4.0199999999999996,null,0]
[39,28.62,3.93,null,0]
[40,28.32,3.85,null,0]
[41,28.02,3.77,null,0]
[42,27.72,3.69,null,0]
[43,27.4,3.61,null,0]
[44,27.07,3.53,null,0]
[45,26.74,3.45,null,0]
[46,26.4,3.38,null,0]
[47,26.05,3.3,null,0]
[48,25.69,3.23,null,0]
[49,25.32,3.15,null,0]
[50,24.93,3.08,null,0]
[51,24.54,3.02,null,0]
[52,24.12,2.95,null,0]
[53,23.7,2.89,null,0]
[54,23.26,2.84,null,0]
[55,22.81,2.78,null,0]
[56,22.35,2.73,null,0]
[57,21.87,2.68,null,0]
[58,21.39,2.64,null,0]
[59,20.89,2.59,null,0]
[60,20.37,2.5499999999999998,null,0]
[61,19.850000000000001,2.52,null,0]
[62,19.309999999999999,2.48,null,0]
[63,18.760000000000002,2.4500000000000002,null,0]
[64,18.190000000000001,2.39,null,0]
[65,17.62,2.33]
[66,17.04,2.2999999999999998]
[67,16.440000000000001,2.2799999999999998]
[68,15.84,2.25]
[69,15.23,2.16,3.05]
[70,14.61,2.0699999999999998,2.84]
[71,14,2.04,2.65]
[72,13.38,2.02,2.46]
[73,12.77,1.99,2.2799999999999998]
[74,12.15,1.84,2.09]
[75,11.55,1.69,1.92]
[76,10.95,1.66,1.76]
[77,10.36,1.63,1.61]
[78,9.7799999999999994,1.59,1.47]
[79,9.2100000000000009,1.4,1.32]
[80,8.66,1.22,1.17]
[81,8.1300000000000008,1.18,1.06]
[82,7.62,1.1399999999999999,0.95]
[83,7.13,1.1000000000000001,0.86]
[84,6.66,0.93,0.75]
[85,6.21,0.77,0.65]
[86,5.78,0.73,0.57999999999999996]
[87,5.37,0.69,0.52]
[88,4.9800000000000004,0.66,0.46]
[89,4.62,0.51,0.39]
[90,4.28,0.38,0.33]
[91,3.97,0.35,0.28999999999999998]
[92,3.68,0.33,0.26]
[93,3.41,0.31,0.23]
[94,3.17,0.28999999999999998,0.2]
[95,2.95,0.27,0.18]

{"sheet":"x-304","index":45,"n_rows":101,"n_cols":5,"rows_kept":101,"cut":false,"hidden":false,"merged":[]}
["Government Actuary's Department"]
[{"$f":"IF(title=\"> Enter workbook title here\",\"Enter workbook title in Cover sheet\",title)","v":"TPS (England & Wales) - Consolidated Factor Spreadsheet"}]
[{"$f":"TABLE_FACTOR_TYPE&\" - x-\"&TABLE_SERIES_NUMBER","v":"Pensioner Cash Equivalent - x-304"}]
[]
[]
["Data Item","Factor Table Information"]
["Client","TPS_EW"]
["Section","All"]
["Factor Type","Pensioner Cash Equivalent"]
["Description","TPS, Factors to calculate pensioner cash equivalents on divorce - retirement on grounds of ill health - ages 20 to 95"]
["Gender","Female"]
["Factor Age/Period Definition","Age last birthday at relevant date"]
["Section Number",0]
["Series Number",304]
["Table Reference","x-304"]
["Table Reference in Guidance","Table 333"]
["Associated Guidance Note","Teachers' Pension Scheme: Final salary sections and career average section\nPensioner cash equivalents on divorce\nDate: 12 May 2021"]
["Date Factors Issued to Client","2023-05-26"]
["Date Factors Implemented (if known)"]
["Factor Status","Issued"]
[]
[null,{"$f":"HYPERLINK(\"#'Factor List'!A1\",\"Back to Factor List\")","v":"Back to Factor List"}]
[]
[]
["Age","Member's Pension of £1 pa","Survivor's Pension of £1 pa","Deduction for GMP of £1 pa","Deduction for NI Modification of £1 pa"]
[20,33.49,5.2,null,0]
[21,33.24,5.16,null,0]
[22,33,5.1100000000000003,null,0]
[23,32.75,5.0599999999999996,null,0]
[24,32.5,5.01,null,0]
[25,32.25,4.96,null,0]
[26,32,4.91,null,0]
[27,31.74,4.8499999999999996,null,0]
[28,31.48,4.79,null,0]
[29,31.23,4.72,null,0]
[30,30.98,4.6500000000000004,null,0]
[31,30.73,4.58,null,0]
[32,30.48,4.51,null,0]
[33,30.22,4.43,null,0]
[34,29.97,4.3499999999999996,null,0]
[35,29.71,4.26,null,0]
[36,29.45,4.18,null,0]
[37,29.18,4.0999999999999996,null,0]
[38,28.9,4.0199999999999996,null,0]
[39,28.62,3.93,null,0]
[40,28.32,3.85,null,0]
[41,28.02,3.77,null,0]
[42,27.72,3.69,null,0]
[43,27.4,3.61,null,0]
[44,27.07,3.53,null,0]
[45,26.74,3.45,null,0]
[46,26.4,3.38,null,0]
[47,26.05,3.3,null,0]
[48,25.69,3.23,null,0]
[49,25.32,3.15,null,0]
[50,24.93,3.08,null,0]
[51,24.54,3.02,null,0]
[52,24.12,2.95,null,0]
[53,23.7,2.89,null,0]
[54,23.26,2.84,null,0]
[55,22.81,2.78,null,0]
[56,22.35,2.73,null,0]
[57,21.87,2.68,null,0]
[58,21.39,2.64,null,0]
[59,20.89,2.59,null,0]
[60,20.37,2.5499999999999998,null,0]
[61,19.850000000000001,2.52,null,0]
[62,19.309999999999999,2.48,null,0]
[63,18.760000000000002,2.4500000000000002,null,0]
[64,18.190000000000001,2.39,null,0]
[65,17.62,2.33]
[66,17.04,2.2999999999999998]
[67,16.440000000000001,2.2799999999999998]
[68,15.84,2.25]
[69,15.23,2.16,2.7]
[70,14.61,2.0699999999999998,2.5099999999999998]
[71,14,2.04,2.3199999999999998]
[72,13.38,2.02,2.14]
[73,12.77,1.99,1.97]
[74,12.15,1.84,1.8]
[75,11.55,1.69,1.64]
[76,10.95,1.66,1.49]
[77,10.36,1.63,1.35]
[78,9.7799999999999994,1.59,1.22]
[79,9.2100000000000009,1.4,1.1000000000000001]
[80,8.66,1.22,0.98]
[81,8.1300000000000008,1.18,0.88]
[82,7.62,1.1399999999999999,0.78]
[83,7.13,1.1000000000000001,0.69]
[84,6.66,0.93,0.61]
[85,6.21,0.77,0.54]
[86,5.78,0.73,0.47]
[87,5.37,0.69,0.41]
[88,4.9800000000000004,0.66,0.36]
[89,4.62,0.51,0.31]
[90,4.28,0.38,0.27]
[91,3.97,0.35,0.24]
[92,3.68,0.33,0.2]
[93,3.41,0.31,0.18]
[94,3.17,0.28999999999999998,0.15]
[95,2.95,0.27,0.13]

{"sheet":"x-305","index":46,"n_rows":85,"n_cols":3,"rows_kept":85,"cut":false,"hidden":false,"merged":[]}
["Government Actuary's Department"]
[{"$f":"IF(title=\"> Enter workbook title here\",\"Enter workbook title in Cover sheet\",title)","v":"TPS (England & Wales) - Consolidated Factor Spreadsheet"}]
[{"$f":"TABLE_FACTOR_TYPE&\" - x-\"&TABLE_SERIES_NUMBER","v":"Capitalisation - x-305"}]
[]
[]
["Data Item","Factor Table Information"]
["Client","TPS_EW"]
["Section","Final Salary"]
["Factor Type","Capitalisation"]
["Description","Factors for calculating divorce fee deduction, male, NPA 60"]
["Gender","Male"]
["Factor Age/Period Definition","Age last birthday at relevant date"]
["Section Number",1]
["Series Number",305]
["Table Reference","x-305"]
["Table Reference in Guidance","Table DF60M"]
["Associated Guidance Note","Teachers' Pension Scheme: Final salary sections and career average section\nRecovering pensions on divorce administration charges: deduction from benefits: Factors and guidance\nDate: 8 November 2019"]
["Date Factors Issued to Client","2023-05-26"]
["Date Factors Implemented (if known)"]
["Factor Status","Issued"]
[]
[null,{"$f":"HYPERLINK(\"#'Factor List'!A1\",\"Back to Factor List\")","v":"Back to Factor List"}]
[]
[]
["Age","Gross pension of £1 pa","Lump Sum of £1"]
[16,11.66,0.48]
[17,11.84,0.49]
[18,12.01,0.5]
[19,12.2,0.51]
[20,12.38,0.51]
[21,12.57,0.52]
[22,12.76,0.53]
[23,12.95,0.54]
[24,13.14,0.55000000000000004]
[25,13.34,0.56000000000000005]
[26,13.54,0.56999999999999995]
[27,13.75,0.57999999999999996]
[28,13.96,0.59]
[29,14.17,0.6]
[30,14.38,0.61]
[31,14.6,0.62]
[32,14.82,0.63]
[33,15.04,0.64]
[34,15.27,0.65]
[35,15.5,0.66]
[36,15.74,0.67]
[37,15.98,0.68]
[38,16.22,0.7]
[39,16.47,0.71]
[40,16.72,0.72]
[41,16.98,0.73]
[42,17.239999999999998,0.74]
[43,17.510000000000002,0.76]
[44,17.78,0.77]
[45,18.05,0.78]
[46,18.329999999999998,0.8]
[47,18.62,0.81]
[48,18.91,0.82]
[49,19.21,0.84]
[50,19.510000000000002,0.85]
[51,19.82,0.87]
[52,20.14,0.88]
[53,20.46,0.9]
[54,20.79,0.91]
[55,21.13,0.93]
[56,21.48,0.94]
[57,21.84,0.96]
[58,22.21,0.98]
[59,22.59,0.99]
[60,22.47,1]
[61,21.84,1]
[62,21.21,1]
[63,20.58,1]
[64,19.95,1]
[65,19.309999999999999,1]
[66,18.66,1]
[67,18.02,1]
[68,17.37,1]
[69,16.71,1]
[70,16.059999999999999,1]
[71,15.4,1]
[72,14.74,1]
[73,14.08,1]
[74,13.42,1]
[75,12.77,1]

{"sheet":"x-306","index":47,"n_rows":85,"n_cols":3,"rows_kept":85,"cut":false,"hidden":false,"merged":[]}
["Government Actuary's Department"]
[{"$f":"IF(title=\"> Enter workbook title here\",\"Enter workbook title in Cover sheet\",title)","v":"TPS (England & Wales) - Consolidated Factor Spreadsheet"}]
[{"$f":"TABLE_FACTOR_TYPE&\" - x-\"&TABLE_SERIES_NUMBER","v":"Capitalisation - x-306"}]
[]
[]
["Data Item","Factor Table Information"]
["Client","TPS_EW"]
["Section","Final Salary"]
["Factor Type","Capitalisation"]
["Description","Factors for calculating divorce fee deduction, female, NPA 60"]
["Gender","Female"]
["Factor Age/Period Definition","Age last birthday at relevant date"]
["Section Number",1]
["Series Number",306]
["Table Reference","x-306"]
["Table Reference in Guidance","Table DF60F"]
["Associated Guidance Note","Teachers' Pension Scheme: Final salary sections and career average section\nRecovering pensions on divorce administration charges: deduction from benefits: Factors and guidance\nDate: 8 November 2019"]
["Date Factors Issued to Client","2023-05-26"]
["Date Factors Implemented (if known)"]
["Factor Status","Issued"]
[]
[null,{"$f":"HYPERLINK(\"#'Factor List'!A1\",\"Back to Factor List\")","v":"Back to Factor List"}]
[]
[]
["Age","Gross pension of £1 pa","Lump Sum of £1"]
[16,11.66,0.48]
[17,11.84,0.49]
[18,12.01,0.5]
[19,12.2,0.51]
[20,12.38,0.51]
[21,12.57,0.52]
[22,12.76,0.53]
[23,12.95,0.54]
[24,13.14,0.55000000000000004]
[25,13.34,0.56000000000000005]
[26,13.54,0.56999999999999995]
[27,13.75,0.57999999999999996]
[28,13.96,0.59]
[29,14.17,0.6]
[30,14.38,0.61]
[31,14.6,0.62]
[32,14.82,0.63]
[33,15.04,0.64]
[34,15.27,0.65]
[35,15.5,0.66]
[36,15.74,0.67]
[37,15.98,0.68]
[38,16.22,0.7]
[39,16.47,0.71]
[40,16.72,0.72]
[41,16.98,0.73]
[42,17.239999999999998,0.74]
[43,17.510000000000002,0.76]
[44,17.78,0.77]
[45,18.05,0.78]
[46,18.329999999999998,0.8]
[47,18.62,0.81]
[48,18.91,0.82]
[49,19.21,0.84]
[50,19.510000000000002,0.85]
[51,19.82,0.87]
[52,20.14,0.88]
[53,20.46,0.9]
[54,20.79,0.91]
[55,21.13,0.93]
[56,21.48,0.94]
[57,21.84,0.96]
[58,22.21,0.98]
[59,22.59,0.99]
[60,22.47,1]
[61,21.84,1]
[62,21.21,1]
[63,20.58,1]
[64,19.95,1]
[65,19.309999999999999,1]
[66,18.66,1]
[67,18.02,1]
[68,17.37,1]
[69,16.71,1]
[70,16.059999999999999,1]
[71,15.4,1]
[72,14.74,1]
[73,14.08,1]
[74,13.42,1]
[75,12.77,1]

{"sheet":"x-307","index":48,"n_rows":85,"n_cols":2,"rows_kept":85,"cut":false,"hidden":false,"merged":[]}
["Government Actuary's Department"]
[{"$f":"IF(title=\"> Enter workbook title here\",\"Enter workbook title in Cover sheet\",title)","v":"TPS (England & Wales) - Consolidated Factor Spreadsheet"}]
[{"$f":"TABLE_FACTOR_TYPE&\" - x-\"&TABLE_SERIES_NUMBER","v":"Capitalisation - x-307"}]
[]
[]
["Data Item","Factor Table Information"]
["Client","TPS_EW"]
["Section","All"]
["Factor Type","Capitalisation"]
["Description","Factors for calculating divorce fee deduction, male, NPA 65"]
["Gender","Male"]
["Factor Age/Period Definition","Age last birthday at relevant date"]
["Section Number",0]
["Series Number",307]
["Table Reference","x-307"]
["Table Reference in Guidance","Table DF65M"]
["Associated Guidance Note","Teachers' Pension Scheme: Final salary sections and career average section\nRecovering pensions on divorce administration charges: deduction from benefits: Factors and guidance\nDate: 8 November 2019"]
["Date Factors Issued to Client","2023-05-26"]
["Date Factors Implemented (if known)"]
["Factor Status","Issued"]
[]
[null,{"$f":"HYPERLINK(\"#'Factor List'!A1\",\"Back to Factor List\")","v":"Back to Factor List"}]
[]
[]
["Age","Gross pension of £1 pa"]
[16,9.42]
[17,9.56]
[18,9.6999999999999993]
[19,9.84]
[20,9.99]
[21,10.130000000000001]
[22,10.28]
[23,10.43]
[24,10.59]
[25,10.74]
[26,10.9]
[27,11.06]
[28,11.22]
[29,11.39]
[30,11.55]
[31,11.72]
[32,11.89]
[33,12.07]
[34,12.25]
[35,12.43]
[36,12.61]
[37,12.8]
[38,12.99]
[39,13.18]
[40,13.37]
[41,13.57]
[42,13.77]
[43,13.98]
[44,14.19]
[45,14.4]
[46,14.62]
[47,14.84]
[48,15.06]
[49,15.29]
[50,15.52]
[51,15.76]
[52,16.010000000000002]
[53,16.260000000000002]
[54,16.510000000000002]
[55,16.77]
[56,17.04]
[57,17.309999999999999]
[58,17.600000000000001]
[59,17.89]
[60,18.190000000000001]
[61,18.5]
[62,18.82]
[63,19.16]
[64,19.510000000000002]
[65,19.36]
[66,18.7]
[67,18.04]
[68,17.38]
[69,16.72]
[70,16.059999999999999]
[71,15.4]
[72,14.74]
[73,14.08]
[74,13.42]
[75,12.77]

{"sheet":"x-308","index":49,"n_rows":85,"n_cols":2,"rows_kept":85,"cut":false,"hidden":false,"merged":[]}
["Government Actuary's Department"]
[{"$f":"IF(title=\"> Enter workbook title here\",\"Enter workbook title in Cover sheet\",title)","v":"TPS (England & Wales) - Consolidated Factor Spreadsheet"}]
[{"$f":"TABLE_FACTOR_TYPE&\" - x-\"&TABLE_SERIES_NUMBER","v":"Capitalisation - x-308"}]
[]
[]
["Data Item","Factor Table Information"]
["Client","TPS_EW"]
["Section","All"]
["Factor Type","Capitalisation"]
["Description","Factors for calculating divorce fee deduction, female, NPA 65"]
["Gender","Female"]
["Factor Age/Period Definition","Age last birthday at relevant date"]
["Section Number",0]
["Series Number",308]
["Table Reference","x-308"]
["Table Reference in Guidance","Table DF65F"]
["Associated Guidance Note","Teachers' Pension Scheme: Final salary sections and career average section\nRecovering pensions on divorce administration charges: deduction from benefits: Factors and guidance\nDate: 8 November 2019"]
["Date Factors Issued to Client","2023-05-26"]
["Date Factors Implemented (if known)"]
["Factor Status","Issued"]
[]
[null,{"$f":"HYPERLINK(\"#'Factor List'!A1\",\"Back to Factor List\")","v":"Back to Factor List"}]
[]
[]
["Age","Gross pension of £1 pa"]
[16,9.42]
[17,9.56]
[18,9.6999999999999993]
[19,9.84]
[20,9.99]
[21,10.130000000000001]
[22,10.28]
[23,10.43]
[24,10.59]
[25,10.74]
[26,10.9]
[27,11.06]
[28,11.22]
[29,11.39]
[30,11.55]
[31,11.72]
[32,11.89]
[33,12.07]
[34,12.25]
[35,12.43]
[36,12.61]
[37,12.8]
[38,12.99]
[39,13.18]
[40,13.37]
[41,13.57]
[42,13.77]
[43,13.98]
[44,14.19]
[45,14.4]
[46,14.62]
[47,14.84]
[48,15.06]
[49,15.29]
[50,15.52]
[51,15.76]
[52,16.010000000000002]
[53,16.260000000000002]
[54,16.510000000000002]
[55,16.77]
[56,17.04]
[57,17.309999999999999]
[58,17.600000000000001]
[59,17.89]
[60,18.190000000000001]
[61,18.5]
[62,18.82]
[63,19.16]
[64,19.510000000000002]
[65,19.36]
[66,18.7]
[67,18.04]
[68,17.38]
[69,16.72]
[70,16.059999999999999]
[71,15.4]
[72,14.74]
[73,14.08]
[74,13.42]
[75,12.77]

{"sheet":"x-309","index":50,"n_rows":85,"n_cols":2,"rows_kept":85,"cut":false,"hidden":false,"merged":[]}
["Government Actuary's Department"]
[{"$f":"IF(title=\"> Enter workbook title here\",\"Enter workbook title in Cover sheet\",title)","v":"TPS (England & Wales) - Consolidated Factor Spreadsheet"}]
[{"$f":"TABLE_FACTOR_TYPE&\" - x-\"&TABLE_SERIES_NUMBER","v":"Capitalisation - x-309"}]
[]
[]
["Data Item","Factor Table Information"]
["Client","TPS_EW"]
["Section","Career Average"]
["Factor Type","Capitalisation"]
["Description","Factors for calculating divorce fee deduction, male, NPA 66"]
["Gender","Male"]
["Factor Age/Period Definition","Age last birthday at relevant date"]
["Section Number",0]
["Series Number",309]
["Table Reference","x-309"]
["Table Reference in Guidance","Table DF66M"]
["Associated Guidance Note","Teachers' Pension Scheme: Final salary sections and career average section\nRecovering pensions on divorce administration charges: deduction from benefits: Factors and guidance\nDate: 8 November 2019"]
["Date Factors Issued to Client","2023-05-26"]
["Date Factors Implemented (if known)"]
["Factor Status","Issued"]
[]
[null,{"$f":"HYPERLINK(\"#'Factor List'!A1\",\"Back to Factor List\")","v":"Back to Factor List"}]
[]
[]
["Age","Gross pension of £1 pa"]
[16,9]
[17,9.1300000000000008]
[18,9.26]
[19,9.4]
[20,9.5399999999999991]
[21,9.68]
[22,9.82]
[23,9.9600000000000009]
[24,10.1]
[25,10.25]
[26,10.4]
[27,10.55]
[28,10.7]
[29,10.86]
[30,11.02]
[31,11.18]
[32,11.34]
[33,11.51]
[34,11.68]
[35,11.85]
[36,12.02]
[37,12.2]
[38,12.37]
[39,12.56]
[40,12.74]
[41,12.93]
[42,13.12]
[43,13.31]
[44,13.51]
[45,13.71]
[46,13.92]
[47,14.12]
[48,14.34]
[49,14.55]
[50,14.77]
[51,15]
[52,15.23]
[53,15.46]
[54,15.7]
[55,15.95]
[56,16.2]
[57,16.46]
[58,16.73]
[59,17]
[60,17.29]
[61,17.579999999999998]
[62,17.88]
[63,18.2]
[64,18.53]
[65,18.87]
[66,18.72]
[67,18.05]
[68,17.39]
[69,16.72]
[70,16.059999999999999]
[71,15.4]
[72,14.74]
[73,14.08]
[74,13.42]
[75,12.77]

{"sheet":"x-310","index":51,"n_rows":85,"n_cols":2,"rows_kept":85,"cut":false,"hidden":false,"merged":[]}
["Government Actuary's Department"]
[{"$f":"IF(title=\"> Enter workbook title here\",\"Enter workbook title in Cover sheet\",title)","v":"TPS (England & Wales) - Consolidated Factor Spreadsheet"}]
[{"$f":"TABLE_FACTOR_TYPE&\" - x-\"&TABLE_SERIES_NUMBER","v":"Capitalisation - x-310"}]
[]
[]
["Data Item","Factor Table Information"]
["Client","TPS_EW"]
["Section","Career Average"]
["Factor Type","Capitalisation"]
["Description","Factors for calculating divorce fee deduction, female, NPA 66"]
["Gender","Female"]
["Factor Age/Period Definition","Age last birthday at relevant date"]
["Section Number",0]
["Series Number",310]
["Table Reference","x-310"]
["Table Reference in Guidance","Table DF66F"]
["Associated Guidance Note","Teachers' Pension Scheme: Final salary sections and career average section\nRecovering pensions on divorce administration charges: deduction from benefits: Factors and guidance\nDate: 8 November 2019"]
["Date Factors Issued to Client","2023-05-26"]
["Date Factors Implemented (if known)"]
["Factor Status","Issued"]
[]
[null,{"$f":"HYPERLINK(\"#'Factor List'!A1\",\"Back to Factor List\")","v":"Back to Factor List"}]
[]
[]
["Age","Gross pension of £1 pa"]
[16,9]
[17,9.1300000000000008]
[18,9.26]
[19,9.4]
[20,9.5399999999999991]
[21,9.68]
[22,9.82]
[23,9.9600000000000009]
[24,10.1]
[25,10.25]
[26,10.4]
[27,10.55]
[28,10.7]
[29,10.86]
[30,11.02]
[31,11.18]
[32,11.34]
[33,11.51]
[34,11.68]
[35,11.85]
[36,12.02]
[37,12.2]
[38,12.37]
[39,12.56]
[40,12.74]
[41,12.93]
[42,13.12]
[43,13.31]
[44,13.51]
[45,13.71]
[46,13.92]
[47,14.12]
[48,14.34]
[49,14.55]
[50,14.77]
[51,15]
[52,15.23]
[53,15.46]
[54,15.7]
[55,15.95]
[56,16.2]
[57,16.46]
[58,16.73]
[59,17]
[60,17.29]
[61,17.579999999999998]
[62,17.88]
[63,18.2]
[64,18.53]
[65,18.87]
[66,18.72]
[67,18.05]
[68,17.39]
[69,16.72]
[70,16.059999999999999]
[71,15.4]
[72,14.74]
[73,14.08]
[74,13.42]
[75,12.77]

{"sheet":"x-311","index":52,"n_rows":85,"n_cols":2,"rows_kept":85,"cut":false,"hidden":false,"merged":[]}
["Government Actuary's Department"]
[{"$f":"IF(title=\"> Enter workbook title here\",\"Enter workbook title in Cover sheet\",title)","v":"TPS (England & Wales) - Consolidated Factor Spreadsheet"}]
[{"$f":"TABLE_FACTOR_TYPE&\" - x-\"&TABLE_SERIES_NUMBER","v":"Capitalisation - x-311"}]
[]
[]
["Data Item","Factor Table Information"]
["Client","TPS_EW"]
["Section","Career Average"]
["Factor Type","Capitalisation"]
["Description","Factors for calculating divorce fee deduction, male, NPA 67"]
["Gender","Male"]
["Factor Age/Period Definition","Age last birthday at relevant date"]
["Section Number",0]
["Series Number",311]
["Table Reference","x-311"]
["Table Reference in Guidance","Table DF67M"]
["Associated Guidance Note","Teachers' Pension Scheme: Final salary sections and career average section\nRecovering pensions on divorce administration charges: deduction from benefits: Factors and guidance\nDate: 8 November 2019"]
["Date Factors Issued to Client","2023-05-26"]
["Date Factors Implemented (if known)"]
["Factor Status","Issued"]
[]
[null,{"$f":"HYPERLINK(\"#'Factor List'!A1\",\"Back to Factor List\")","v":"Back to Factor List"}]
[]
[]
["Age","Gross pension of £1 pa"]
[16,8.59]
[17,8.7100000000000009]
[18,8.84]
[19,8.9600000000000009]
[20,9.09]
[21,9.23]
[22,9.36]
[23,9.49]
[24,9.6300000000000008]
[25,9.77]
[26,9.91]
[27,10.050000000000001]
[28,10.199999999999999]
[29,10.35]
[30,10.5]
[31,10.65]
[32,10.8]
[33,10.96]
[34,11.12]
[35,11.28]
[36,11.44]
[37,11.61]
[38,11.78]
[39,11.95]
[40,12.12]
[41,12.3]
[42,12.48]
[43,12.66]
[44,12.85]
[45,13.04]
[46,13.23]
[47,13.43]
[48,13.63]
[49,13.83]
[50,14.04]
[51,14.25]
[52,14.47]
[53,14.69]
[54,14.92]
[55,15.15]
[56,15.38]
[57,15.63]
[58,15.88]
[59,16.14]
[60,16.41]
[61,16.68]
[62,16.97]
[63,17.27]
[64,17.579999999999998]
[65,17.899999999999999]
[66,18.239999999999998]
[67,18.079999999999998]
[68,17.41]
[69,16.739999999999998]
[70,16.059999999999999]
[71,15.4]
[72,14.74]
[73,14.08]
[74,13.42]
[75,12.77]

{"sheet":"x-312","index":53,"n_rows":85,"n_cols":2,"rows_kept":85,"cut":false,"hidden":false,"merged":[]}
["Government Actuary's Department"]
[{"$f":"IF(title=\"> Enter workbook title here\",\"Enter workbook title in Cover sheet\",title)","v":"TPS (England & Wales) - Consolidated Factor Spreadsheet"}]
[{"$f":"TABLE_FACTOR_TYPE&\" - x-\"&TABLE_SERIES_NUMBER","v":"Capitalisation - x-312"}]
[]
[]
["Data Item","Factor Table Information"]
["Client","TPS_EW"]
["Section","Career Average"]
["Factor Type","Capitalisation"]
["Description","Factors for calculating divorce fee deduction, female, NPA 67"]
["Gender","Female"]
["Factor Age/Period Definition","Age last birthday at relevant date"]
["Section Number",0]
["Series Number",312]
["Table Reference","x-312"]
["Table Reference in Guidance","Table DF67F"]
["Associated Guidance Note","Teachers' Pension Scheme: Final salary sections and career average section\nRecovering pensions on divorce administration charges: deduction from benefits: Factors and guidance\nDate: 8 November 2019"]
["Date Factors Issued to Client","2023-05-26"]
["Date Factors Implemented (if known)"]
["Factor Status","Issued"]
[]
[null,{"$f":"HYPERLINK(\"#'Factor List'!A1\",\"Back to Factor List\")","v":"Back to Factor List"}]
[]
[]
["Age","Gross pension of £1 pa"]
[16,8.59]
[17,8.7100000000000009]
[18,8.84]
[19,8.9600000000000009]
[20,9.09]
[21,9.23]
[22,9.36]
[23,9.49]
[24,9.6300000000000008]
[25,9.77]
[26,9.91]
[27,10.050000000000001]
[28,10.199999999999999]
[29,10.35]
[30,10.5]
[31,10.65]
[32,10.8]
[33,10.96]
[34,11.12]
[35,11.28]
[36,11.44]
[37,11.61]
[38,11.78]
[39,11.95]
[40,12.12]
[41,12.3]
[42,12.48]
[43,12.66]
[44,12.85]
[45,13.04]
[46,13.23]
[47,13.43]
[48,13.63]
[49,13.83]
[50,14.04]
[51,14.25]
[52,14.47]
[53,14.69]
[54,14.92]
[55,15.15]
[56,15.38]
[57,15.63]
[58,15.88]
[59,16.14]
[60,16.41]
[61,16.68]
[62,16.97]
[63,17.27]
[64,17.579999999999998]
[65,17.899999999999999]
[66,18.239999999999998]
[67,18.079999999999998]
[68,17.41]
[69,16.739999999999998]
[70,16.059999999999999]
[71,15.4]
[72,14.74]
[73,14.08]
[74,13.42]
[75,12.77]

{"sheet":"x-313","index":54,"n_rows":85,"n_cols":2,"rows_kept":85,"cut":false,"hidden":false,"merged":[]}
["Government Actuary's Department"]
[{"$f":"IF(title=\"> Enter workbook title here\",\"Enter workbook title in Cover sheet\",title)","v":"TPS (England & Wales) - Consolidated Factor Spreadsheet"}]
[{"$f":"TABLE_FACTOR_TYPE&\" - x-\"&TABLE_SERIES_NUMBER","v":"Capitalisation - x-313"}]
[]
[]
["Data Item","Factor Table Information"]
["Client","TPS_EW"]
["Section","Career Average"]
["Factor Type","Capitalisation"]
["Description","Factors for calculating divorce fee deduction, male, NPA 68"]
["Gender","Male"]
["Factor Age/Period Definition","Age last birthday at relevant date"]
["Section Number",0]
["Series Number",313]
["Table Reference","x-313"]
["Table Reference in Guidance","Table DF68M"]
["Associated Guidance Note","Teachers' Pension Scheme: Final salary sections and career average section\nRecovering pensions on divorce administration charges: deduction from benefits: Factors and guidance\nDate: 8 November 2019"]
["Date Factors Issued to Client","2023-05-26"]
["Date Factors Implemented (if known)"]
["Factor Status","Issued"]
[]
[null,{"$f":"HYPERLINK(\"#'Factor List'!A1\",\"Back to Factor List\")","v":"Back to Factor List"}]
[]
[]
["Age","Gross pension of £1 pa"]
[16,8.18]
[17,8.3000000000000007]
[18,8.42]
[19,8.5399999999999991]
[20,8.66]
[21,8.7799999999999994]
[22,8.91]
[23,9.0399999999999991]
[24,9.17]
[25,9.3000000000000007]
[26,9.43]
[27,9.57]
[28,9.6999999999999993]
[29,9.84]
[30,9.98]
[31,10.130000000000001]
[32,10.27]
[33,10.42]
[34,10.57]
[35,10.72]
[36,10.88]
[37,11.03]
[38,11.19]
[39,11.35]
[40,11.52]
[41,11.68]
[42,11.85]
[43,12.03]
[44,12.2]
[45,12.38]
[46,12.56]
[47,12.74]
[48,12.93]
[49,13.12]
[50,13.32]
[51,13.52]
[52,13.72]
[53,13.93]
[54,14.14]
[55,14.36]
[56,14.58]
[57,14.81]
[58,15.05]
[59,15.29]
[60,15.54]
[61,15.8]
[62,16.07]
[63,16.350000000000001]
[64,16.64]
[65,16.95]
[66,17.27]
[67,17.600000000000001]
[68,17.43]
[69,16.760000000000002]
[70,16.079999999999998]
[71,15.41]
[72,14.74]
[73,14.08]
[74,13.42]
[75,12.77]

{"sheet":"x-314","index":55,"n_rows":85,"n_cols":2,"rows_kept":85,"cut":false,"hidden":false,"merged":[]}
["Government Actuary's Department"]
[{"$f":"IF(title=\"> Enter workbook title here\",\"Enter workbook title in Cover sheet\",title)","v":"TPS (England & Wales) - Consolidated Factor Spreadsheet"}]
[{"$f":"TABLE_FACTOR_TYPE&\" - x-\"&TABLE_SERIES_NUMBER","v":"Capitalisation - x-314"}]
[]
[]
["Data Item","Factor Table Information"]
["Client","TPS_EW"]
["Section","Career Average"]
["Factor Type","Capitalisation"]
["Description","Factors for calculating divorce fee deduction, female, NPA 68"]
["Gender","Female"]
["Factor Age/Period Definition","Age last birthday at relevant date"]
["Section Number",0]
["Series Number",314]
["Table Reference","x-314"]
["Table Reference in Guidance","Table DF68F"]
["Associated Guidance Note","Teachers' Pension Scheme: Final salary sections and career average section\nRecovering pensions on divorce administration charges: deduction from benefits: Factors and guidance\nDate: 8 November 2019"]
["Date Factors Issued to Client","2023-05-26"]
["Date Factors Implemented (if known)"]
["Factor Status","Issued"]
[]
[null,{"$f":"HYPERLINK(\"#'Factor List'!A1\",\"Back to Factor List\")","v":"Back to Factor List"}]
[]
[]
["Age","Gross pension of £1 pa"]
[16,8.18]
[17,8.3000000000000007]
[18,8.42]
[19,8.5399999999999991]
[20,8.66]
[21,8.7799999999999994]
[22,8.91]
[23,9.0399999999999991]
[24,9.17]
[25,9.3000000000000007]
[26,9.43]
[27,9.57]
[28,9.6999999999999993]
[29,9.84]
[30,9.98]
[31,10.130000000000001]
[32,10.27]
[33,10.42]
[34,10.57]
[35,10.72]
[36,10.88]
[37,11.03]
[38,11.19]
[39,11.35]
[40,11.52]
[41,11.68]
[42,11.85]
[43,12.03]
[44,12.2]
[45,12.38]
[46,12.56]
[47,12.74]
[48,12.93]
[49,13.12]
[50,13.32]
[51,13.52]
[52,13.72]
[53,13.93]
[54,14.14]
[55,14.36]
[56,14.58]
[57,14.81]
[58,15.05]
[59,15.29]
[60,15.54]
[61,15.8]
[62,16.07]
[63,16.350000000000001]
[64,16.64]
[65,16.95]
[66,17.27]
[67,17.600000000000001]
[68,17.43]
[69,16.760000000000002]
[70,16.079999999999998]
[71,15.41]
[72,14.74]
[73,14.08]
[74,13.42]
[75,12.77]

{"sheet":"x-315","index":56,"n_rows":105,"n_cols":3,"rows_kept":105,"cut":false,"hidden":false,"merged":[]}
["Government Actuary's Department"]
[{"$f":"IF(title=\"> Enter workbook title here\",\"Enter workbook title in Cover sheet\",title)","v":"TPS (England & Wales) - Consolidated Factor Spreadsheet"}]
[{"$f":"TABLE_FACTOR_TYPE&\" - x-\"&TABLE_SERIES_NUMBER","v":"Pension Credit - x-315"}]
[]
[]
["Data Item","Factor Table Information"]
["Client","TPS_EW"]
["Section","Final Salary"]
["Factor Type","Pension Credit"]
["Description","Factors for calculating divorce pension credits for male ex-spouses, NPA 60"]
["Gender","Male"]
["Factor Age/Period Definition","Age last birthday at relevant date"]
["Section Number",1]
["Series Number",315]
["Table Reference","x-315"]
["Table Reference in Guidance","Table 403"]
["Associated Guidance Note","Teachers' Pension Scheme: Final salary section and career average section\nPension credits on divorce: Factors and guidance\nDate: 27 October 2019"]
["Date Factors Issued to Client","2023-05-26"]
["Date Factors Implemented (if known)"]
["Factor Status","Issued"]
[]
[null,{"$f":"HYPERLINK(\"#'Factor List'!A1\",\"Back to Factor List\")","v":"Back to Factor List"}]
[]
[]
["Age","Gross Pension of £1 pa","Lump Sum of £1"]
[16,11.36,0.48]
[17,11.53,0.49]
[18,11.7,0.5]
[19,11.88,0.51]
[20,12.05,0.51]
[21,12.23,0.52]
[22,12.42,0.53]
[23,12.6,0.54]
[24,12.79,0.55000000000000004]
[25,12.98,0.56000000000000005]
[26,13.18,0.56999999999999995]
[27,13.37,0.57999999999999996]
[28,13.57,0.59]
[29,13.78,0.6]
[30,13.98,0.61]
[31,14.19,0.62]
[32,14.41,0.63]
[33,14.63,0.64]
[34,14.85,0.65]
[35,15.07,0.66]
[36,15.3,0.67]
[37,15.53,0.68]
[38,15.77,0.7]
[39,16.010000000000002,0.71]
[40,16.25,0.72]
[41,16.5,0.73]
[42,16.760000000000002,0.74]
[43,17.02,0.76]
[44,17.28,0.77]
[45,17.55,0.78]
[46,17.829999999999998,0.8]
[47,18.11,0.81]
[48,18.399999999999999,0.82]
[49,18.690000000000001,0.84]
[50,18.989999999999998,0.85]
[51,19.29,0.87]
[52,19.61,0.88]
[53,19.93,0.9]
[54,20.260000000000002,0.91]
[55,20.59,0.93]
[56,20.94,0.94]
[57,21.29,0.96]
[58,21.66,0.98]
[59,22.04,0.99]
[60,21.91,1]
[61,21.28,1]
[62,20.65,1]
[63,20.010000000000002,1]
[64,19.38,1]
[65,18.739999999999998,1]
[66,18.09,1]
[67,17.45,1]
[68,16.8,1]
[69,16.149999999999999,1]
[70,15.5,1]
[71,14.85,1]
[72,14.2,1]
[73,13.55,1]
[74,12.9,1]
[75,12.26,1]
[76,11.63,1]
[77,11,1]
[78,10.38,1]
[79,9.7799999999999994,1]
[80,9.19,1]
[81,8.61,1]
[82,8.06,1]
[83,7.52,1]
[84,7.01,1]
[85,6.51,1]
[86,6.04,1]
[87,5.6,1]
[88,5.18,1]
[89,4.79,1]
[90,4.42,1]
[91,4.09,1]
[92,3.78,1]
[93,3.5,1]
[94,3.24,1]
[95,3.02,1]

{"sheet":"x-316","index":57,"n_rows":105,"n_cols":3,"rows_kept":105,"cut":false,"hidden":false,"merged":[]}
["Government Actuary's Department"]
[{"$f":"IF(title=\"> Enter workbook title here\",\"Enter workbook title in Cover sheet\",title)","v":"TPS (England & Wales) - Consolidated Factor Spreadsheet"}]
[{"$f":"TABLE_FACTOR_TYPE&\" - x-\"&TABLE_SERIES_NUMBER","v":"Pension Credit - x-316"}]
[]
[]
["Data Item","Factor Table Information"]
["Client","TPS_EW"]
["Section","Final Salary"]
["Factor Type","Pension Credit"]
["Description","Factors for calculating divorce pension credits for female ex-spouses, NPA 60"]
["Gender","Female"]
["Factor Age/Period Definition","Age last birthday at relevant date"]
["Section Number",1]
["Series Number",316]
["Table Reference","x-316"]
["Table Reference in Guidance","Table 413"]
["Associated Guidance Note","Teachers' Pension Scheme: Final salary section and career average section\nPension credits on divorce: Factors and guidance\nDate: 27 October 2019"]
["Date Factors Issued to Client","2023-05-26"]
["Date Factors Implemented (if known)"]
["Factor Status","Issued"]
[]
[null,{"$f":"HYPERLINK(\"#'Factor List'!A1\",\"Back to Factor List\")","v":"Back to Factor List"}]
[]
[]
["Age","Gross Pension of £1 pa","Lump Sum of £1"]
[16,11.36,0.48]
[17,11.53,0.49]
[18,11.7,0.5]
[19,11.88,0.51]
[20,12.05,0.51]
[21,12.23,0.52]
[22,12.42,0.53]
[23,12.6,0.54]
[24,12.79,0.55000000000000004]
[25,12.98,0.56000000000000005]
[26,13.18,0.56999999999999995]
[27,13.37,0.57999999999999996]
[28,13.57,0.59]
[29,13.78,0.6]
[30,13.98,0.61]
[31,14.19,0.62]
[32,14.41,0.63]
[33,14.63,0.64]
[34,14.85,0.65]
[35,15.07,0.66]
[36,15.3,0.67]
[37,15.53,0.68]
[38,15.77,0.7]
[39,16.010000000000002,0.71]
[40,16.25,0.72]
[41,16.5,0.73]
[42,16.760000000000002,0.74]
[43,17.02,0.76]
[44,17.28,0.77]
[45,17.55,0.78]
[46,17.829999999999998,0.8]
[47,18.11,0.81]
[48,18.399999999999999,0.82]
[49,18.690000000000001,0.84]
[50,18.989999999999998,0.85]
[51,19.29,0.87]
[52,19.61,0.88]
[53,19.93,0.9]
[54,20.260000000000002,0.91]
[55,20.59,0.93]
[56,20.94,0.94]
[57,21.29,0.96]
[58,21.66,0.98]
[59,22.04,0.99]
[60,21.91,1]
[61,21.28,1]
[62,20.65,1]
[63,20.010000000000002,1]
[64,19.38,1]
[65,18.739999999999998,1]
[66,18.09,1]
[67,17.45,1]
[68,16.8,1]
[69,16.149999999999999,1]
[70,15.5,1]
[71,14.85,1]
[72,14.2,1]
[73,13.55,1]
[74,12.9,1]
[75,12.26,1]
[76,11.63,1]
[77,11,1]
[78,10.38,1]
[79,9.7799999999999994,1]
[80,9.19,1]
[81,8.61,1]
[82,8.06,1]
[83,7.52,1]
[84,7.01,1]
[85,6.51,1]
[86,6.04,1]
[87,5.6,1]
[88,5.18,1]
[89,4.79,1]
[90,4.42,1]
[91,4.09,1]
[92,3.78,1]
[93,3.5,1]
[94,3.24,1]
[95,3.02,1]

{"sheet":"x-317","index":58,"n_rows":105,"n_cols":2,"rows_kept":105,"cut":false,"hidden":false,"merged":[]}
["Government Actuary's Department"]
[{"$f":"IF(title=\"> Enter workbook title here\",\"Enter workbook title in Cover sheet\",title)","v":"TPS (England & Wales) - Consolidated Factor Spreadsheet"}]
[{"$f":"TABLE_FACTOR_TYPE&\" - x-\"&TABLE_SERIES_NUMBER","v":"Pension Credit - x-317"}]
[]
[]
["Data Item","Factor Table Information"]
["Client","TPS_EW"]
["Section","All"]
["Factor Type","Pension Credit"]
["Description","Factors for calculating divorce pension credits for male ex-spouses, NPA 65"]
["Gender","Male"]
["Factor Age/Period Definition","Age last birthday at relevant date"]
["Section Number",0]
["Series Number",317]
["Table Reference","x-317"]
["Table Reference in Guidance","Table 423"]
["Associated Guidance Note","Teachers' Pension Scheme: Final salary section and career average section\nPension credits on divorce: Factors and guidance\nDate: 27 October 2019"]
["Date Factors Issued to Client","2023-05-26"]
["Date Factors Implemented (if known)"]
["Factor Status","Issued"]
[]
[null,{"$f":"HYPERLINK(\"#'Factor List'!A1\",\"Back to Factor List\")","v":"Back to Factor List"}]
[]
[]
["Age","Gross Pension of £1 pa"]
[16,9.14]
[17,9.2799999999999994]
[18,9.41]
[19,9.5500000000000007]
[20,9.68]
[21,9.82]
[22,9.9700000000000006]
[23,10.11]
[24,10.26]
[25,10.4]
[26,10.56]
[27,10.71]
[28,10.86]
[29,11.02]
[30,11.18]
[31,11.34]
[32,11.51]
[33,11.68]
[34,11.85]
[35,12.02]
[36,12.2]
[37,12.38]
[38,12.56]
[39,12.74]
[40,12.93]
[41,13.12]
[42,13.32]
[43,13.52]
[44,13.72]
[45,13.93]
[46,14.14]
[47,14.35]
[48,14.57]
[49,14.79]
[50,15.02]
[51,15.26]
[52,15.49]
[53,15.74]
[54,15.99]
[55,16.25]
[56,16.510000000000002]
[57,16.78]
[58,17.059999999999999]
[59,17.34]
[60,17.64]
[61,17.95]
[62,18.27]
[63,18.600000000000001]
[64,18.95]
[65,18.79]
[66,18.13]
[67,17.47]
[68,16.809999999999999]
[69,16.149999999999999]
[70,15.5]
[71,14.85]
[72,14.2]
[73,13.55]
[74,12.9]
[75,12.26]
[76,11.63]
[77,11]
[78,10.38]
[79,9.7799999999999994]
[80,9.19]
[81,8.61]
[82,8.06]
[83,7.52]
[84,7.01]
[85,6.51]
[86,6.04]
[87,5.6]
[88,5.18]
[89,4.79]
[90,4.42]
[91,4.09]
[92,3.78]
[93,3.5]
[94,3.24]
[95,3.02]

{"sheet":"x-318","index":59,"n_rows":105,"n_cols":2,"rows_kept":105,"cut":false,"hidden":false,"merged":[]}
["Government Actuary's Department"]
[{"$f":"IF(title=\"> Enter workbook title here\",\"Enter workbook title in Cover sheet\",title)","v":"TPS (England & Wales) - Consolidated Factor Spreadsheet"}]
[{"$f":"TABLE_FACTOR_TYPE&\" - x-\"&TABLE_SERIES_NUMBER","v":"Pension Credit - x-318"}]
[]
[]
["Data Item","Factor Table Information"]
["Client","TPS_EW"]
["Section","All"]
["Factor Type","Pension Credit"]
["Description","Factors for calculating divorce pension credits for female ex-spouses, NPA 65"]
["Gender","Female"]
["Factor Age/Period Definition","Age last birthday at relevant date"]
["Section Number",0]
["Series Number",318]
["Table Reference","x-318"]
["Table Reference in Guidance","Table 433"]
["Associated Guidance Note","Teachers' Pension Scheme: Final salary section and career average section\nPension credits on divorce: Factors and guidance\nDate: 27 October 2019"]
["Date Factors Issued to Client","2023-05-26"]
["Date Factors Implemented (if known)"]
["Factor Status","Issued"]
[]
[null,{"$f":"HYPERLINK(\"#'Factor List'!A1\",\"Back to Factor List\")","v":"Back to Factor List"}]
[]
[]
["Age","Gross Pension of £1 pa"]
[16,9.14]
[17,9.2799999999999994]
[18,9.41]
[19,9.5500000000000007]
[20,9.68]
[21,9.82]
[22,9.9700000000000006]
[23,10.11]
[24,10.26]
[25,10.4]
[26,10.56]
[27,10.71]
[28,10.86]
[29,11.02]
[30,11.18]
[31,11.34]
[32,11.51]
[33,11.68]
[34,11.85]
[35,12.02]
[36,12.2]
[37,12.38]
[38,12.56]
[39,12.74]
[40,12.93]
[41,13.12]
[42,13.32]
[43,13.52]
[44,13.72]
[45,13.93]
[46,14.14]
[47,14.35]
[48,14.57]
[49,14.79]
[50,15.02]
[51,15.26]
[52,15.49]
[53,15.74]
[54,15.99]
[55,16.25]
[56,16.510000000000002]
[57,16.78]
[58,17.059999999999999]
[59,17.34]
[60,17.64]
[61,17.95]
[62,18.27]
[63,18.600000000000001]
[64,18.95]
[65,18.79]
[66,18.13]
[67,17.47]
[68,16.809999999999999]
[69,16.149999999999999]
[70,15.5]
[71,14.85]
[72,14.2]
[73,13.55]
[74,12.9]
[75,12.26]
[76,11.63]
[77,11]
[78,10.38]
[79,9.7799999999999994]
[80,9.19]
[81,8.61]
[82,8.06]
[83,7.52]
[84,7.01]
[85,6.51]
[86,6.04]
[87,5.6]
[88,5.18]
[89,4.79]
[90,4.42]
[91,4.09]
[92,3.78]
[93,3.5]
[94,3.24]
[95,3.02]

{"sheet":"x-319","index":60,"n_rows":105,"n_cols":2,"rows_kept":105,"cut":false,"hidden":false,"merged":[]}
["Government Actuary's Department"]
[{"$f":"IF(title=\"> Enter workbook title here\",\"Enter workbook title in Cover sheet\",title)","v":"TPS (England & Wales) - Consolidated Factor Spreadsheet"}]
[{"$f":"TABLE_FACTOR_TYPE&\" - x-\"&TABLE_SERIES_NUMBER","v":"Pension Credit - x-319"}]
[]
[]
["Data Item","Factor Table Information"]
["Client","TPS_EW"]
["Section","Career Average"]
["Factor Type","Pension Credit"]
["Description","Factors for calculating divorce pension credits for male ex-spouses, NPA 66"]
["Gender","Male"]
["Factor Age/Period Definition","Age last birthday at relevant date"]
["Section Number",0]
["Series Number",319]
["Table Reference","x-319"]
["Table Reference in Guidance","Table 443"]
["Associated Guidance Note","Teachers' Pension Scheme: Final salary section and career average section\nPension credits on divorce: Factors and guidance\nDate: 27 October 2019"]
["Date Factors Issued to Client","2023-05-26"]
["Date Factors Implemented (if known)"]
["Factor Status","Issued"]
[]
[null,{"$f":"HYPERLINK(\"#'Factor List'!A1\",\"Back to Factor List\")","v":"Back to Factor List"}]
[]
[]
["Age","Gross Pension of £1 pa"]
[16,8.73]
[17,8.85]
[18,8.98]
[19,9.11]
[20,9.24]
[21,9.3699999999999992]
[22,9.5]
[23,9.64]
[24,9.7799999999999994]
[25,9.92]
[26,10.06]
[27,10.210000000000001]
[28,10.35]
[29,10.5]
[30,10.65]
[31,10.81]
[32,10.96]
[33,11.12]
[34,11.28]
[35,11.45]
[36,11.61]
[37,11.78]
[38,11.95]
[39,12.13]
[40,12.31]
[41,12.49]
[42,12.67]
[43,12.86]
[44,13.05]
[45,13.24]
[46,13.44]
[47,13.64]
[48,13.85]
[49,14.06]
[50,14.28]
[51,14.5]
[52,14.72]
[53,14.95]
[54,15.19]
[55,15.43]
[56,15.68]
[57,15.93]
[58,16.190000000000001]
[59,16.46]
[60,16.739999999999998]
[61,17.03]
[62,17.329999999999998]
[63,17.64]
[64,17.97]
[65,18.309999999999999]
[66,18.16]
[67,17.489999999999998]
[68,16.82]
[69,16.16]
[70,15.5]
[71,14.85]
[72,14.2]
[73,13.55]
[74,12.9]
[75,12.26]
[76,11.63]
[77,11]
[78,10.38]
[79,9.7799999999999994]
[80,9.19]
[81,8.61]
[82,8.06]
[83,7.52]
[84,7.01]
[85,6.51]
[86,6.04]
[87,5.6]
[88,5.18]
[89,4.79]
[90,4.42]
[91,4.09]
[92,3.78]
[93,3.5]
[94,3.24]
[95,3.02]

{"sheet":"x-320","index":61,"n_rows":105,"n_cols":2,"rows_kept":105,"cut":false,"hidden":false,"merged":[]}
["Government Actuary's Department"]
[{"$f":"IF(title=\"> Enter workbook title here\",\"Enter workbook title in Cover sheet\",title)","v":"TPS (England & Wales) - Consolidated Factor Spreadsheet"}]
[{"$f":"TABLE_FACTOR_TYPE&\" - x-\"&TABLE_SERIES_NUMBER","v":"Pension Credit - x-320"}]
[]
[]
["Data Item","Factor Table Information"]
["Client","TPS_EW"]
["Section","Career Average"]
["Factor Type","Pension Credit"]
["Description","Factors for calculating divorce pension credits for female ex-spouses, NPA 66"]
["Gender","Female"]
["Factor Age/Period Definition","Age last birthday at relevant date"]
["Section Number",0]
["Series Number",320]
["Table Reference","x-320"]
["Table Reference in Guidance","Table 453"]
["Associated Guidance Note","Teachers' Pension Scheme: Final salary section and career average section\nPension credits on divorce: Factors and guidance\nDate: 27 October 2019"]
["Date Factors Issued to Client","2023-05-26"]
["Date Factors Implemented (if known)"]
["Factor Status","Issued"]
[]
[null,{"$f":"HYPERLINK(\"#'Factor List'!A1\",\"Back to Factor List\")","v":"Back to Factor List"}]
[]
[]
["Age","Gross Pension of £1 pa"]
[16,8.73]
[17,8.85]
[18,8.98]
[19,9.11]
[20,9.24]
[21,9.3699999999999992]
[22,9.5]
[23,9.64]
[24,9.7799999999999994]
[25,9.92]
[26,10.06]
[27,10.210000000000001]
[28,10.35]
[29,10.5]
[30,10.65]
[31,10.81]
[32,10.96]
[33,11.12]
[34,11.28]
[35,11.45]
[36,11.61]
[37,11.78]
[38,11.95]
[39,12.13]
[40,12.31]
[41,12.49]
[42,12.67]
[43,12.86]
[44,13.05]
[45,13.24]
[46,13.44]
[47,13.64]
[48,13.85]
[49,14.06]
[50,14.28]
[51,14.5]
[52,14.72]
[53,14.95]
[54,15.19]
[55,15.43]
[56,15.68]
[57,15.93]
[58,16.190000000000001]
[59,16.46]
[60,16.739999999999998]
[61,17.03]
[62,17.329999999999998]
[63,17.64]
[64,17.97]
[65,18.309999999999999]
[66,18.16]
[67,17.489999999999998]
[68,16.82]
[69,16.16]
[70,15.5]
[71,14.85]
[72,14.2]
[73,13.55]
[74,12.9]
[75,12.26]
[76,11.63]
[77,11]
[78,10.38]
[79,9.7799999999999994]
[80,9.19]
[81,8.61]
[82,8.06]
[83,7.52]
[84,7.01]
[85,6.51]
[86,6.04]
[87,5.6]
[88,5.18]
[89,4.79]
[90,4.42]
[91,4.09]
[92,3.78]
[93,3.5]
[94,3.24]
[95,3.02]

{"sheet":"x-321","index":62,"n_rows":105,"n_cols":2,"rows_kept":105,"cut":false,"hidden":false,"merged":[]}
["Government Actuary's Department"]
[{"$f":"IF(title=\"> Enter workbook title here\",\"Enter workbook title in Cover sheet\",title)","v":"TPS (England & Wales) - Consolidated Factor Spreadsheet"}]
[{"$f":"TABLE_FACTOR_TYPE&\" - x-\"&TABLE_SERIES_NUMBER","v":"Pension Credit - x-321"}]
[]
[]
["Data Item","Factor Table Information"]
["Client","TPS_EW"]
["Section","Career Average"]
["Factor Type","Pension Credit"]
["Description","Factors for calculating divorce pension credits for male ex-spouses, NPA 67"]
["Gender","Male"]
["Factor Age/Period Definition","Age last birthday at relevant date"]
["Section Number",0]
["Series Number",321]
["Table Reference","x-321"]
["Table Reference in Guidance","Table 463"]
["Associated Guidance Note","Teachers' Pension Scheme: Final salary section and career average section\nPension credits on divorce: Factors and guidance\nDate: 27 October 2019"]
["Date Factors Issued to Client","2023-05-26"]
["Date Factors Implemented (if known)"]
["Factor Status","Issued"]
[]
[null,{"$f":"HYPERLINK(\"#'Factor List'!A1\",\"Back to Factor List\")","v":"Back to Factor List"}]
[]
[]
["Age","Gross Pension of £1 pa"]
[16,8.32]
[17,8.43]
[18,8.5500000000000007]
[19,8.68]
[20,8.8000000000000007]
[21,8.92]
[22,9.0500000000000007]
[23,9.18]
[24,9.31]
[25,9.44]
[26,9.58]
[27,9.7100000000000009]
[28,9.85]
[29,9.99]
[30,10.14]
[31,10.28]
[32,10.43]
[33,10.58]
[34,10.73]
[35,10.88]
[36,11.04]
[37,11.2]
[38,11.36]
[39,11.53]
[40,11.69]
[41,11.86]
[42,12.04]
[43,12.21]
[44,12.39]
[45,12.58]
[46,12.76]
[47,12.95]
[48,13.15]
[49,13.35]
[50,13.55]
[51,13.76]
[52,13.97]
[53,14.18]
[54,14.4]
[55,14.63]
[56,14.86]
[57,15.1]
[58,15.35]
[59,15.6]
[60,15.87]
[61,16.14]
[62,16.420000000000002]
[63,16.71]
[64,17.02]
[65,17.34]
[66,17.68]
[67,17.52]
[68,16.850000000000001]
[69,16.18]
[70,15.51]
[71,14.85]
[72,14.2]
[73,13.55]
[74,12.9]
[75,12.26]
[76,11.63]
[77,11]
[78,10.38]
[79,9.7799999999999994]
[80,9.19]
[81,8.61]
[82,8.06]
[83,7.52]
[84,7.01]
[85,6.51]
[86,6.04]
[87,5.6]
[88,5.18]
[89,4.79]
[90,4.42]
[91,4.09]
[92,3.78]
[93,3.5]
[94,3.24]
[95,3.02]

{"sheet":"x-322","index":63,"n_rows":105,"n_cols":2,"rows_kept":105,"cut":false,"hidden":false,"merged":[]}
["Government Actuary's Department"]
[{"$f":"IF(title=\"> Enter workbook title here\",\"Enter workbook title in Cover sheet\",title)","v":"TPS (England & Wales) - Consolidated Factor Spreadsheet"}]
[{"$f":"TABLE_FACTOR_TYPE&\" - x-\"&TABLE_SERIES_NUMBER","v":"Pension Credit - x-322"}]
[]
[]
["Data Item","Factor Table Information"]
["Client","TPS_EW"]
["Section","Career Average"]
["Factor Type","Pension Credit"]
["Description","Factors for calculating divorce pension credits for female ex-spouses, NPA 67"]
["Gender","Female"]
["Factor Age/Period Definition","Age last birthday at relevant date"]
["Section Number",0]
["Series Number",322]
["Table Reference","x-322"]
["Table Reference in Guidance","Table 473"]
["Associated Guidance Note","Teachers' Pension Scheme: Final salary section and career average section\nPension credits on divorce: Factors and guidance\nDate: 27 October 2019"]
["Date Factors Issued to Client","2023-05-26"]
["Date Factors Implemented (if known)"]
["Factor Status","Issued"]
[]
[null,{"$f":"HYPERLINK(\"#'Factor List'!A1\",\"Back to Factor List\")","v":"Back to Factor List"}]
[]
[]
["Age","Gross Pension of £1 pa"]
[16,8.32]
[17,8.43]
[18,8.5500000000000007]
[19,8.68]
[20,8.8000000000000007]
[21,8.92]
[22,9.0500000000000007]
[23,9.18]
[24,9.31]
[25,9.44]
[26,9.58]
[27,9.7100000000000009]
[28,9.85]
[29,9.99]
[30,10.14]
[31,10.28]
[32,10.43]
[33,10.58]
[34,10.73]
[35,10.88]
[36,11.04]
[37,11.2]
[38,11.36]
[39,11.53]
[40,11.69]
[41,11.86]
[42,12.04]
[43,12.21]
[44,12.39]
[45,12.58]
[46,12.76]
[47,12.95]
[48,13.15]
[49,13.35]
[50,13.55]
[51,13.76]
[52,13.97]
[53,14.18]
[54,14.4]
[55,14.63]
[56,14.86]
[57,15.1]
[58,15.35]
[59,15.6]
[60,15.87]
[61,16.14]
[62,16.420000000000002]
[63,16.71]
[64,17.02]
[65,17.34]
[66,17.68]
[67,17.52]
[68,16.850000000000001]
[69,16.18]
[70,15.51]
[71,14.85]
[72,14.2]
[73,13.55]
[74,12.9]
[75,12.26]
[76,11.63]
[77,11]
[78,10.38]
[79,9.7799999999999994]
[80,9.19]
[81,8.61]
[82,8.06]
[83,7.52]
[84,7.01]
[85,6.51]
[86,6.04]
[87,5.6]
[88,5.18]
[89,4.79]
[90,4.42]
[91,4.09]
[92,3.78]
[93,3.5]
[94,3.24]
[95,3.02]

{"sheet":"x-323","index":64,"n_rows":105,"n_cols":2,"rows_kept":105,"cut":false,"hidden":false,"merged":[]}
["Government Actuary's Department"]
[{"$f":"IF(title=\"> Enter workbook title here\",\"Enter workbook title in Cover sheet\",title)","v":"TPS (England & Wales) - Consolidated Factor Spreadsheet"}]
[{"$f":"TABLE_FACTOR_TYPE&\" - x-\"&TABLE_SERIES_NUMBER","v":"Pension Credit - x-323"}]
[]
[]
["Data Item","Factor Table Information"]
["Client","TPS_EW"]
["Section","Career Average"]
["Factor Type","Pension Credit"]
["Description","Factors for calculating divorce pension credits for male ex-spouses, NPA 68"]
["Gender","Male"]
["Factor Age/Period Definition","Age last birthday at relevant date"]
["Section Number",0]
["Series Number",323]
["Table Reference","x-323"]
["Table Reference in Guidance","Table 483"]
["Associated Guidance Note","Teachers' Pension Scheme: Final salary section and career average section\nPension credits on divorce: Factors and guidance\nDate: 27 October 2019"]
["Date Factors Issued to Client","2023-05-26"]
["Date Factors Implemented (if known)"]
["Factor Status","Issued"]
[]
[null,{"$f":"HYPERLINK(\"#'Factor List'!A1\",\"Back to Factor List\")","v":"Back to Factor List"}]
[]
[]
["Age","Gross Pension of £1 pa"]
[16,7.91]
[17,8.0299999999999994]
[18,8.14]
[19,8.25]
[20,8.3699999999999992]
[21,8.49]
[22,8.61]
[23,8.73]
[24,8.85]
[25,8.98]
[26,9.1]
[27,9.23]
[28,9.36]
[29,9.5]
[30,9.6300000000000008]
[31,9.77]
[32,9.91]
[33,10.050000000000001]
[34,10.19]
[35,10.33]
[36,10.48]
[37,10.63]
[38,10.78]
[39,10.94]
[40,11.1]
[41,11.26]
[42,11.42]
[43,11.58]
[44,11.75]
[45,11.92]
[46,12.1]
[47,12.28]
[48,12.46]
[49,12.65]
[50,12.84]
[51,13.03]
[52,13.23]
[53,13.43]
[54,13.64]
[55,13.85]
[56,14.07]
[57,14.29]
[58,14.52]
[59,14.76]
[60,15.01]
[61,15.26]
[62,15.53]
[63,15.8]
[64,16.09]
[65,16.39]
[66,16.71]
[67,17.04]
[68,16.88]
[69,16.2]
[70,15.53]
[71,14.86]
[72,14.2]
[73,13.55]
[74,12.9]
[75,12.26]
[76,11.63]
[77,11]
[78,10.38]
[79,9.7799999999999994]
[80,9.19]
[81,8.61]
[82,8.06]
[83,7.52]
[84,7.01]
[85,6.51]
[86,6.04]
[87,5.6]
[88,5.18]
[89,4.79]
[90,4.42]
[91,4.09]
[92,3.78]
[93,3.5]
[94,3.24]
[95,3.02]

{"sheet":"x-324","index":65,"n_rows":105,"n_cols":2,"rows_kept":105,"cut":false,"hidden":false,"merged":[]}
["Government Actuary's Department"]
[{"$f":"IF(title=\"> Enter workbook title here\",\"Enter workbook title in Cover sheet\",title)","v":"TPS (England & Wales) - Consolidated Factor Spreadsheet"}]
[{"$f":"TABLE_FACTOR_TYPE&\" - x-\"&TABLE_SERIES_NUMBER","v":"Pension Credit - x-324"}]
[]
[]
["Data Item","Factor Table Information"]
["Client","TPS_EW"]
["Section","Career Average"]
["Factor Type","Pension Credit"]
["Description","Factors for calculating divorce pension credits for female ex-spouses, NPA 68"]
["Gender","Female"]
["Factor Age/Period Definition","Age last birthday at relevant date"]
["Section Number",0]
["Series Number",324]
["Table Reference","x-324"]
["Table Reference in Guidance","Table 493"]
["Associated Guidance Note","Teachers' Pension Scheme: Final salary section and career average section\nPension credits on divorce: Factors and guidance\nDate: 27 October 2019"]
["Date Factors Issued to Client","2023-05-26"]
["Date Factors Implemented (if known)"]
["Factor Status","Issued"]
[]
[null,{"$f":"HYPERLINK(\"#'Factor List'!A1\",\"Back to Factor List\")","v":"Back to Factor List"}]
[]
[]
["Age","Gross Pension of £1 pa"]
[16,7.91]
[17,8.0299999999999994]
[18,8.14]
[19,8.25]
[20,8.3699999999999992]
[21,8.49]
[22,8.61]
[23,8.73]
[24,8.85]
[25,8.98]
[26,9.1]
[27,9.23]
[28,9.36]
[29,9.5]
[30,9.6300000000000008]
[31,9.77]
[32,9.91]
[33,10.050000000000001]
[34,10.19]
[35,10.33]
[36,10.48]
[37,10.63]
[38,10.78]
[39,10.94]
[40,11.1]
[41,11.26]
[42,11.42]
[43,11.58]
[44,11.75]
[45,11.92]
[46,12.1]
[47,12.28]
[48,12.46]
[49,12.65]
[50,12.84]
[51,13.03]
[52,13.23]
[53,13.43]
[54,13.64]
[55,13.85]
[56,14.07]
[57,14.29]
[58,14.52]
[59,14.76]
[60,15.01]
[61,15.26]
[62,15.53]
[63,15.8]
[64,16.09]
[65,16.39]
[66,16.71]
[67,17.04]
[68,16.88]
[69,16.2]
[70,15.53]
[71,14.86]
[72,14.2]
[73,13.55]
[74,12.9]
[75,12.26]
[76,11.63]
[77,11]
[78,10.38]
[79,9.7799999999999994]
[80,9.19]
[81,8.61]
[82,8.06]
[83,7.52]
[84,7.01]
[85,6.51]
[86,6.04]
[87,5.6]
[88,5.18]
[89,4.79]
[90,4.42]
[91,4.09]
[92,3.78]
[93,3.5]
[94,3.24]
[95,3.02]

{"sheet":"x-401","index":66,"n_rows":31,"n_cols":13,"rows_kept":31,"cut":false,"hidden":false,"merged":[]}
["Government Actuary's Department"]
[{"$f":"IF(title=\"> Enter workbook title here\",\"Enter workbook title in Cover sheet\",title)","v":"TPS (England & Wales) - Consolidated Factor Spreadsheet"}]
[{"$f":"TABLE_FACTOR_TYPE&\" - x-\"&TABLE_SERIES_NUMBER","v":"ERF - x-401"}]
[]
[]
["Data Item","Factor Table Information"]
["Client","TPS_EW"]
["Section","Final Salary"]
["Factor Type","ERF"]
["Description","Benefits payable to the member on early retirement (with actuarial reduction) - final salary section, NPA 60 members, main scheme pension and lump sum"]
["Gender","Unisex"]
["Factor Age/Period Definition","Age/Completed months"]
["Section Number",1]
["Series Number",401]
["Table Reference","x-401"]
["Table Reference in Guidance","ER1"]
["Associated Guidance Note","Teachers' Pension Scheme: Final salary sections and career average section\nEarly retirements in normal health: Factors and guidance\nDate: 24 June 2019"]
["Date Factors Issued to Client","2023-06-30"]
["Date Factors Implemented (if known)"]
["Factor Status","Issued"]
[]
[null,{"$f":"HYPERLINK(\"#'Factor List'!A1\",\"Back to Factor List\")","v":"Back to Factor List"}]
[]
[]
["Age/Months",0,1,2,3,4,5,6,7,8,9,10,11]
[55,0.82699999999999996,0.83,0.83199999999999996,0.83499999999999996,0.83699999999999997,0.84,0.84199999999999997,0.84499999999999997,0.84699999999999998,0.85,0.85299999999999998,0.85499999999999998]
[56,0.85799999999999998,0.86099999999999999,0.86299999999999999,0.86599999999999999,0.86899999999999999,0.871,0.874,0.877,0.88,0.88200000000000001,0.88500000000000001,0.88800000000000001]
[57,0.89100000000000001,0.89300000000000002,0.89600000000000002,0.89900000000000002,0.90200000000000002,0.90500000000000003,0.90800000000000003,0.91100000000000003,0.91400000000000003,0.91700000000000004,0.91900000000000004,0.92200000000000004]
[58,0.92500000000000004,0.92800000000000005,0.93100000000000005,0.93400000000000005,0.93799999999999994,0.94099999999999995,0.94399999999999995,0.94699999999999995,0.95,0.95299999999999996,0.95599999999999996,0.95899999999999996]
[59,0.96199999999999997,0.96599999999999997,0.96899999999999997,0.97199999999999998,0.97499999999999998,0.97899999999999998,0.98199999999999998,0.98499999999999999,0.98899999999999999,0.99199999999999999,0.995,0.998]
[60,1]

{"sheet":"x-402","index":67,"n_rows":31,"n_cols":13,"rows_kept":31,"cut":false,"hidden":false,"merged":[]}
["Government Actuary's Department"]
[{"$f":"IF(title=\"> Enter workbook title here\",\"Enter workbook title in Cover sheet\",title)","v":"TPS (England & Wales) - Consolidated Factor Spreadsheet"}]
[{"$f":"TABLE_FACTOR_TYPE&\" - x-\"&TABLE_SERIES_NUMBER","v":"ERF - x-402"}]
[]
[]
["Data Item","Factor Table Information"]
["Client","TPS_EW"]
["Section","Final Salary"]
["Factor Type","ERF"]
["Description","Benefits payable to the member on early retirement (with actuarial reduction) - final salary section, NPA 60 members, additional pension, contract exercised on or before 22.06.2010"]
["Gender","Unisex"]
["Factor Age/Period Definition","Age/Completed months"]
["Section Number",1]
["Series Number",402]
["Table Reference","x-402"]
["Table Reference in Guidance","ER2"]
["Associated Guidance Note","Teachers' Pension Scheme: Final salary sections and career average section\nEarly retirements in normal health: Factors and guidance\nDate: 24 June 2019"]
["Date Factors Issued to Client","2023-06-30"]
["Date Factors Implemented (if known)"]
["Factor Status","Issued"]
[]
[null,{"$f":"HYPERLINK(\"#'Factor List'!A1\",\"Back to Factor List\")","v":"Back to Factor List"}]
[]
[]
["Age/Months",0,1,2,3,4,5,6,7,8,9,10,11]
[55,0.86199999999999999,0.86399999999999999,0.86599999999999999,0.86799999999999999,0.87,0.872,0.874,0.876,0.878,0.88,0.88200000000000001,0.88400000000000001]
[56,0.88600000000000001,0.88900000000000001,0.89100000000000001,0.89300000000000002,0.89500000000000002,0.89700000000000002,0.89900000000000002,0.90100000000000002,0.90400000000000003,0.90600000000000003,0.90800000000000003,0.91]
[57,0.91200000000000003,0.91500000000000004,0.91700000000000004,0.91900000000000004,0.92100000000000004,0.92400000000000004,0.92600000000000005,0.92800000000000005,0.93100000000000005,0.93300000000000005,0.93500000000000005,0.93799999999999994]
[58,0.94,0.94199999999999995,0.94499999999999995,0.94699999999999995,0.95,0.95199999999999996,0.95499999999999996,0.95699999999999996,0.96,0.96199999999999997,0.96499999999999997,0.96699999999999997]
[59,0.97,0.97199999999999998,0.97499999999999998,0.97799999999999998,0.98,0.98299999999999998,0.98599999999999999,0.98799999999999999,0.99099999999999999,0.99299999999999999,0.996,0.999]
[60,1]

{"sheet":"x-403","index":68,"n_rows":31,"n_cols":13,"rows_kept":31,"cut":false,"hidden":false,"merged":[]}
["Government Actuary's Department"]
[{"$f":"IF(title=\"> Enter workbook title here\",\"Enter workbook title in Cover sheet\",title)","v":"TPS (England & Wales) - Consolidated Factor Spreadsheet"}]
[{"$f":"TABLE_FACTOR_TYPE&\" - x-\"&TABLE_SERIES_NUMBER","v":"ERF - x-403"}]
[]
[]
["Data Item","Factor Table Information"]
["Client","TPS_EW"]
["Section","Final Salary"]
["Factor Type","ERF"]
["Description","Benefits payable to the member on early retirement (with actuarial reduction) - NPA 60 members, additional pension, contract exercised after 22.6.2010"]
["Gender","Unisex"]
["Factor Age/Period Definition","Age/Completed months"]
["Section Number",1]
["Series Number",403]
["Table Reference","x-403"]
["Table Reference in Guidance","ER3"]
["Associated Guidance Note","Teachers' Pension Scheme: Final salary sections and career average section\nEarly retirements in normal health: Factors and guidance\nDate: 24 June 2019"]
["Date Factors Issued to Client","2023-06-30"]
["Date Factors Implemented (if known)"]
["Factor Status","Issued"]
[]
[null,{"$f":"HYPERLINK(\"#'Factor List'!A1\",\"Back to Factor List\")","v":"Back to Factor List"}]
[]
[]
["Age/Months",0,1,2,3,4,5,6,7,8,9,10,11]
[55,0.81599999999999995,0.81899999999999995,0.82099999999999995,0.82399999999999995,0.82699999999999996,0.83,0.83199999999999996,0.83499999999999996,0.83799999999999997,0.84,0.84299999999999997,0.84599999999999997]
[56,0.84899999999999998,0.85099999999999998,0.85399999999999998,0.85699999999999998,0.86,0.86299999999999999,0.86599999999999999,0.86899999999999999,0.871,0.874,0.877,0.88]
[57,0.88300000000000001,0.88600000000000001,0.88900000000000001,0.89200000000000002,0.89500000000000002,0.89800000000000002,0.90100000000000002,0.90500000000000003,0.90800000000000003,0.91100000000000003,0.91400000000000003,0.91700000000000004]
[58,0.92,0.92300000000000004,0.92700000000000005,0.93,0.93300000000000005,0.93600000000000005,0.94,0.94299999999999995,0.94599999999999995,0.95,0.95299999999999996,0.95599999999999996]
[59,0.96,0.96299999999999997,0.96699999999999997,0.97,0.97399999999999998,0.97699999999999998,0.98099999999999998,0.98399999999999999,0.98799999999999999,0.99099999999999999,0.995,0.998]
[60,1]

{"sheet":"x-404","index":69,"n_rows":36,"n_cols":13,"rows_kept":36,"cut":false,"hidden":false,"merged":[]}
["Government Actuary's Department"]
[{"$f":"IF(title=\"> Enter workbook title here\",\"Enter workbook title in Cover sheet\",title)","v":"TPS (England & Wales) - Consolidated Factor Spreadsheet"}]
[{"$f":"TABLE_FACTOR_TYPE&\" - x-\"&TABLE_SERIES_NUMBER","v":"ERF - x-404"}]
[]
[]
["Data Item","Factor Table Information"]
["Client","TPS_EW"]
["Section","Final Salary"]
["Factor Type","ERF"]
["Description","Benefits payable to the member on early retirement (with actuarial reduction) - final salary section, NPA 65 members, main scheme pension"]
["Gender","Unisex"]
["Factor Age/Period Definition","Age/Completed months"]
["Section Number",1]
["Series Number",404]
["Table Reference","x-404"]
["Table Reference in Guidance","ER4"]
["Associated Guidance Note","Teachers' Pension Scheme: Final salary sections and career average section\nEarly retirements in normal health: Factors and guidance\nDate: 24 June 2019"]
["Date Factors Issued to Client","2023-06-30"]
["Date Factors Implemented (if known)"]
["Factor Status","Issued"]
[]
[null,{"$f":"HYPERLINK(\"#'Factor List'!A1\",\"Back to Factor List\")","v":"Back to Factor List"}]
[]
[]
["Age/Months",0,1,2,3,4,5,6,7,8,9,10,11]
[55,0.64800000000000002,0.65,0.65200000000000002,0.65400000000000003,0.65600000000000003,0.65800000000000003,0.66,0.66300000000000003,0.66500000000000004,0.66700000000000004,0.66900000000000004,0.67100000000000004]
[56,0.67300000000000004,0.67500000000000004,0.67800000000000005,0.68,0.68200000000000005,0.68400000000000005,0.68700000000000006,0.68899999999999995,0.69099999999999995,0.69299999999999995,0.69599999999999995,0.69799999999999995]
[57,0.7,0.70299999999999996,0.70499999999999996,0.70699999999999996,0.71,0.71199999999999997,0.71499999999999997,0.71699999999999997,0.71899999999999997,0.72199999999999998,0.72399999999999998,0.72699999999999998]
[58,0.72899999999999998,0.73199999999999998,0.73399999999999999,0.73699999999999999,0.73899999999999999,0.74199999999999999,0.74399999999999999,0.747,0.75,0.752,0.755,0.75700000000000001]
[59,0.76,0.76300000000000001,0.76600000000000001,0.76800000000000002,0.77100000000000002,0.77400000000000002,0.77700000000000002,0.77900000000000003,0.78200000000000003,0.78500000000000003,0.78800000000000003,0.79]
[60,0.79300000000000004,0.79600000000000004,0.79900000000000004,0.80200000000000005,0.80500000000000005,0.80800000000000005,0.81100000000000005,0.81399999999999995,0.81699999999999995,0.82,0.82299999999999995,0.82599999999999996]
[61,0.82899999999999996,0.83199999999999996,0.83499999999999996,0.83799999999999997,0.84199999999999997,0.84499999999999997,0.84799999999999998,0.85099999999999998,0.85399999999999998,0.85699999999999998,0.86099999999999999,0.86399999999999999]
[62,0.86699999999999999,0.871,0.874,0.877,0.88100000000000001,0.88400000000000001,0.88800000000000001,0.89100000000000001,0.89500000000000002,0.89800000000000002,0.90200000000000002,0.90500000000000003]
[63,0.90900000000000003,0.91200000000000003,0.91600000000000004,0.92,0.92400000000000004,0.92700000000000005,0.93100000000000005,0.93500000000000005,0.93799999999999994,0.94199999999999995,0.94599999999999995,0.95]
[64,0.95299999999999996,0.95799999999999996,0.96199999999999997,0.96599999999999997,0.97,0.97399999999999998,0.97799999999999998,0.98199999999999998,0.98599999999999999,0.99,0.99399999999999999,0.998]
[65,1]

{"sheet":"x-405","index":70,"n_rows":36,"n_cols":13,"rows_kept":36,"cut":false,"hidden":false,"merged":[]}
["Government Actuary's Department"]
[{"$f":"IF(title=\"> Enter workbook title here\",\"Enter workbook title in Cover sheet\",title)","v":"TPS (England & Wales) - Consolidated Factor Spreadsheet"}]
[{"$f":"TABLE_FACTOR_TYPE&\" - x-\"&TABLE_SERIES_NUMBER","v":"ERF - x-405"}]
[]
[]
["Data Item","Factor Table Information"]
["Client","TPS_EW"]
["Section","Final Salary"]
["Factor Type","ERF"]
["Description","Benefits payable to the member on early retirement (with actuarial reduction)  - Final Salary section, NPA 65 members, additional pension, contract exercised on or before 22.06.2010"]
["Gender","Unisex"]
["Factor Age/Period Definition","Age/Completed months"]
["Section Number",1]
["Series Number",405]
["Table Reference","x-405"]
["Table Reference in Guidance","ER5"]
["Associated Guidance Note","Teachers' Pension Scheme: Final salary sections and career average section\nEarly retirements in normal health: Factors and guidance\nDate: 24 June 2019"]
["Date Factors Issued to Client","2023-06-30"]
["Date Factors Implemented (if known)"]
["Factor Status","Issued"]
[]
[null,{"$f":"HYPERLINK(\"#'Factor List'!A1\",\"Back to Factor List\")","v":"Back to Factor List"}]
[]
[]
["Age/Months",0,1,2,3,4,5,6,7,8,9,10,11]
[55,0.69599999999999995,0.69799999999999995,0.7,0.70199999999999996,0.70399999999999996,0.70699999999999996,0.70899999999999996,0.71099999999999997,0.71299999999999997,0.71499999999999997,0.71799999999999997,0.72]
[56,0.72199999999999998,0.72399999999999998,0.72699999999999998,0.72899999999999998,0.73099999999999998,0.73399999999999999,0.73599999999999999,0.73899999999999999,0.74099999999999999,0.74299999999999999,0.746,0.748]
[57,0.75,0.753,0.755,0.75800000000000001,0.76,0.76300000000000001,0.76500000000000001,0.76800000000000002,0.77,0.77300000000000002,0.77500000000000002,0.77800000000000002]
[58,0.78100000000000003,0.78300000000000003,0.78600000000000003,0.78900000000000003,0.79100000000000004,0.79400000000000004,0.79700000000000004,0.79900000000000004,0.80200000000000005,0.80500000000000005,0.80700000000000005,0.81]
[59,0.81200000000000006,0.81499999999999995,0.81699999999999995,0.81899999999999995,0.82099999999999995,0.82299999999999995,0.82499999999999996,0.82699999999999996,0.82899999999999996,0.83099999999999996,0.83399999999999996,0.83599999999999997]
[60,0.83799999999999997,0.84,0.84199999999999997,0.84499999999999997,0.84699999999999998,0.84899999999999998,0.85199999999999998,0.85399999999999998,0.85599999999999998,0.85799999999999998,0.86099999999999999,0.86299999999999999]
[61,0.86499999999999999,0.86799999999999999,0.87,0.873,0.875,0.878,0.88,0.88300000000000001,0.88500000000000001,0.88800000000000001,0.89,0.89300000000000002]
[62,0.89500000000000002,0.89800000000000002,0.90100000000000002,0.90300000000000002,0.90600000000000003,0.90900000000000003,0.91200000000000003,0.91400000000000003,0.91700000000000004,0.92,0.92200000000000004,0.92500000000000004]
[63,0.92800000000000005,0.93100000000000005,0.93400000000000005,0.93700000000000006,0.94,0.94299999999999995,0.94599999999999995,0.94899999999999995,0.95199999999999996,0.95499999999999996,0.95799999999999996,0.96099999999999997]
[64,0.96399999999999997,0.96699999999999997,0.97,0.97299999999999998,0.97599999999999998,0.98,0.98299999999999998,0.98599999999999999,0.98899999999999999,0.99199999999999999,0.995,0.998]
[65,1]

{"sheet":"x-406","index":71,"n_rows":36,"n_cols":13,"rows_kept":36,"cut":false,"hidden":false,"merged":[]}
["Government Actuary's Department"]
[{"$f":"IF(title=\"> Enter workbook title here\",\"Enter workbook title in Cover sheet\",title)","v":"TPS (England & Wales) - Consolidated Factor Spreadsheet"}]
[{"$f":"TABLE_FACTOR_TYPE&\" - x-\"&TABLE_SERIES_NUMBER","v":"ERF - x-406"}]
[]
[]
["Data Item","Factor Table Information"]
["Client","TPS_EW"]
["Section","Final Salary"]
["Factor Type","ERF"]
["Description","Benefits payable to the member on early retirement (with actuarial reduction)  - Final Salary Section, NPA 65 members, Additional pension, contract exercised after 22.6.2010"]
["Gender","Unisex"]
["Factor Age/Period Definition","Age/Completed months"]
["Section Number",1]
["Series Number",406]
["Table Reference","x-406"]
["Table Reference in Guidance","ER6"]
["Associated Guidance Note","Teachers' Pension Scheme: Final salary sections and career average section\nEarly retirements in normal health: Factors and guidance\nDate: 24 June 2019"]
["Date Factors Issued to Client","2023-06-30"]
["Date Factors Implemented (if known)"]
["Factor Status","Issued"]
[]
[null,{"$f":"HYPERLINK(\"#'Factor List'!A1\",\"Back to Factor List\")","v":"Back to Factor List"}]
[]
[]
["Age/Months",0,1,2,3,4,5,6,7,8,9,10,11]
[55,0.64800000000000002,0.65,0.65200000000000002,0.65400000000000003,0.65600000000000003,0.65800000000000003,0.66,0.66300000000000003,0.66500000000000004,0.66700000000000004,0.66900000000000004,0.67100000000000004]
[56,0.67300000000000004,0.67500000000000004,0.67800000000000005,0.68,0.68200000000000005,0.68400000000000005,0.68700000000000006,0.68899999999999995,0.69099999999999995,0.69299999999999995,0.69599999999999995,0.69799999999999995]
[57,0.7,0.70299999999999996,0.70499999999999996,0.70699999999999996,0.71,0.71199999999999997,0.71499999999999997,0.71699999999999997,0.71899999999999997,0.72199999999999998,0.72399999999999998,0.72699999999999998]
[58,0.72899999999999998,0.73199999999999998,0.73399999999999999,0.73699999999999999,0.73899999999999999,0.74199999999999999,0.74399999999999999,0.747,0.75,0.752,0.755,0.75700000000000001]
[59,0.76,0.76300000000000001,0.76600000000000001,0.76800000000000002,0.77100000000000002,0.77400000000000002,0.77700000000000002,0.77900000000000003,0.78200000000000003,0.78500000000000003,0.78800000000000003,0.79]
[60,0.79300000000000004,0.79600000000000004,0.79900000000000004,0.80200000000000005,0.80500000000000005,0.80800000000000005,0.81100000000000005,0.81399999999999995,0.81699999999999995,0.82,0.82299999999999995,0.82599999999999996]
[61,0.82899999999999996,0.83199999999999996,0.83499999999999996,0.83799999999999997,0.84199999999999997,0.84499999999999997,0.84799999999999998,0.85099999999999998,0.85399999999999998,0.85699999999999998,0.86099999999999999,0.86399999999999999]
[62,0.86699999999999999,0.871,0.874,0.877,0.88100000000000001,0.88400000000000001,0.88800000000000001,0.89100000000000001,0.89500000000000002,0.89800000000000002,0.90200000000000002,0.90500000000000003]
[63,0.90900000000000003,0.91200000000000003,0.91600000000000004,0.92,0.92400000000000004,0.92700000000000005,0.93100000000000005,0.93500000000000005,0.93799999999999994,0.94199999999999995,0.94599999999999995,0.95]
[64,0.95299999999999996,0.95799999999999996,0.96199999999999997,0.96599999999999997,0.97,0.97399999999999998,0.97799999999999998,0.98199999999999998,0.98599999999999999,0.99,0.99399999999999999,0.998]
[65,1]

{"sheet":"x-407","index":72,"n_rows":36,"n_cols":13,"rows_kept":36,"cut":false,"hidden":false,"merged":[]}
["Government Actuary's Department"]
[{"$f":"IF(title=\"> Enter workbook title here\",\"Enter workbook title in Cover sheet\",title)","v":"TPS (England & Wales) - Consolidated Factor Spreadsheet"}]
[{"$f":"TABLE_FACTOR_TYPE&\" - x-\"&TABLE_SERIES_NUMBER","v":"ERF - x-407"}]
[]
[]
["Data Item","Factor Table Information"]
["Client","TPS_EW"]
["Section","Career Average"]
["Factor Type","ERF"]
["Description","Benefits payable to the member on early retirement (with actuarial reduction) - Career Average Section, Active members, All NPAs, full retirement earned pension"]
["Gender","Unisex"]
["Factor Age/Period Definition","Age/Completed months"]
["Section Number",0]
["Series Number",407]
["Table Reference","x-407"]
["Table Reference in Guidance","ER7"]
["Associated Guidance Note","Teachers' Pension Scheme: Final salary sections and career average section\nEarly retirements in normal health: Factors and guidance\nDate: 24 June 2019"]
["Date Factors Issued to Client","2023-06-30"]
["Date Factors Implemented (if known)"]
["Factor Status","Issued"]
[]
[null,{"$f":"HYPERLINK(\"#'Factor List'!A1\",\"Back to Factor List\")","v":"Back to Factor List"}]
[]
[]
["Age/Months",0,1,2,3,4,5,6,7,8,9,10,11]
[55,0.64800000000000002,0.65,0.65200000000000002,0.65400000000000003,0.65600000000000003,0.65800000000000003,0.66,0.66300000000000003,0.66500000000000004,0.66700000000000004,0.66900000000000004,0.67100000000000004]
[56,0.67300000000000004,0.67500000000000004,0.67800000000000005,0.68,0.68200000000000005,0.68400000000000005,0.68700000000000006,0.68899999999999995,0.69099999999999995,0.69299999999999995,0.69599999999999995,0.69799999999999995]
[57,0.7,0.70299999999999996,0.70499999999999996,0.70699999999999996,0.71,0.71199999999999997,0.71499999999999997,0.71699999999999997,0.71899999999999997,0.72199999999999998,0.72399999999999998,0.72699999999999998]
[58,0.72899999999999998,0.73199999999999998,0.73399999999999999,0.73699999999999999,0.73899999999999999,0.74199999999999999,0.74399999999999999,0.747,0.75,0.752,0.755,0.75700000000000001]
[59,0.76,0.76300000000000001,0.76600000000000001,0.76800000000000002,0.77100000000000002,0.77400000000000002,0.77700000000000002,0.77900000000000003,0.78200000000000003,0.78500000000000003,0.78800000000000003,0.79]
[60,0.79300000000000004,0.79600000000000004,0.79900000000000004,0.80200000000000005,0.80500000000000005,0.80800000000000005,0.81100000000000005,0.81399999999999995,0.81699999999999995,0.82,0.82299999999999995,0.82599999999999996]
[61,0.82899999999999996,0.83199999999999996,0.83499999999999996,0.83799999999999997,0.84199999999999997,0.84499999999999997,0.84799999999999998,0.85099999999999998,0.85399999999999998,0.85699999999999998,0.86099999999999999,0.86399999999999999]
[62,0.86699999999999999,0.871,0.874,0.877,0.88100000000000001,0.88400000000000001,0.88800000000000001,0.89100000000000001,0.89500000000000002,0.89800000000000002,0.90200000000000002,0.90500000000000003]
[63,0.90900000000000003,0.91200000000000003,0.91600000000000004,0.92,0.92400000000000004,0.92700000000000005,0.93100000000000005,0.93500000000000005,0.93799999999999994,0.94199999999999995,0.94599999999999995,0.95]
[64,0.95299999999999996,0.95799999999999996,0.96199999999999997,0.96599999999999997,0.97,0.97399999999999998,0.97799999999999998,0.98199999999999998,0.98599999999999999,0.99,0.99399999999999999,0.998]
[65,1]

{"sheet":"x-408","index":73,"n_rows":39,"n_cols":13,"rows_kept":39,"cut":false,"hidden":false,"merged":[]}
["Government Actuary's Department"]
[{"$f":"IF(title=\"> Enter workbook title here\",\"Enter workbook title in Cover sheet\",title)","v":"TPS (England & Wales) - Consolidated Factor Spreadsheet"}]
[{"$f":"TABLE_FACTOR_TYPE&\" - x-\"&TABLE_SERIES_NUMBER","v":"ERF - x-408"}]
[]
[]
["Data Item","Factor Table Information"]
["Client","TPS_EW"]
["Section","Career Average"]
["Factor Type","ERF"]
["Description","Benefits payable to the member on early retirement (with actuarial reduction) - (1) Career average section, deferred members, all NPAs, full retirement earned pension (2) career average section, active and deferred members, all NPAs, additional pension and pension debits (3) career average section, pension credit members, all NPAs."]
["Gender","Unisex"]
["Factor Age/Period Definition","Period to NPA"]
["Section Number",0]
["Series Number",408]
["Table Reference","x-408"]
["Table Reference in Guidance","ER8"]
["Associated Guidance Note","Teachers' Pension Scheme: Final salary sections and career average section\nEarly retirements in normal health: Factors and guidance\nDate: 24 June 2019"]
["Date Factors Issued to Client","2023-06-30"]
["Date Factors Implemented (if known)"]
["Factor Status","Issued"]
[]
[null,{"$f":"HYPERLINK(\"#'Factor List'!A1\",\"Back to Factor List\")","v":"Back to Factor List"}]
[]
[]
["Years/Months Early",0,1,2,3,4,5,6,7,8,9,10,11]
[0,1,0.998,0.99399999999999999,0.98899999999999999,0.98499999999999999,0.98099999999999998,0.97599999999999998,0.97199999999999998,0.96799999999999997,0.96299999999999997,0.95899999999999996,0.95499999999999996]
[1,0.95,0.94599999999999995,0.94199999999999995,0.93799999999999994,0.93400000000000005,0.93100000000000005,0.92700000000000005,0.92300000000000004,0.91900000000000004,0.91500000000000004,0.91100000000000003,0.90700000000000003]
[2,0.90300000000000002,0.89900000000000002,0.89600000000000002,0.89200000000000002,0.88800000000000001,0.88500000000000001,0.88100000000000001,0.877,0.874,0.87,0.86699999999999999,0.86299999999999999]
[3,0.85899999999999999,0.85599999999999998,0.85199999999999998,0.84899999999999998,0.84599999999999997,0.84199999999999997,0.83899999999999997,0.83599999999999997,0.83199999999999996,0.82899999999999996,0.82599999999999996,0.82199999999999995]
[4,0.81899999999999995,0.81599999999999995,0.81299999999999994,0.81,0.80700000000000005,0.80300000000000005,0.8,0.79700000000000004,0.79400000000000004,0.79100000000000004,0.78800000000000003,0.78500000000000003]
[5,0.78200000000000003,0.77900000000000003,0.77600000000000002,0.77300000000000002,0.77,0.76700000000000002,0.76500000000000001,0.76200000000000001,0.75900000000000001,0.75600000000000001,0.753,0.75]
[6,0.747,0.745,0.74199999999999999,0.73899999999999999,0.73699999999999999,0.73399999999999999,0.73099999999999998,0.72899999999999998,0.72599999999999998,0.72299999999999998,0.72099999999999997,0.71799999999999997]
[7,0.71599999999999997,0.71299999999999997,0.71,0.70799999999999996,0.70599999999999996,0.70299999999999996,0.70099999999999996,0.69799999999999995,0.69599999999999995,0.69299999999999995,0.69099999999999995,0.68799999999999994]
[8,0.68600000000000005,0.68300000000000005,0.68100000000000005,0.67900000000000005,0.67600000000000005,0.67400000000000004,0.67200000000000004,0.67,0.66700000000000004,0.66500000000000004,0.66300000000000003,0.66]
[9,0.65800000000000003,0.65600000000000003,0.65400000000000003,0.65200000000000002,0.64900000000000002,0.64700000000000002,0.64500000000000002,0.64300000000000002,0.64100000000000001,0.63900000000000001,0.63600000000000001,0.63400000000000001]
[10,0.63200000000000001,0.63,0.628,0.626,0.624,0.622,0.62,0.61799999999999999,0.61599999999999999,0.61399999999999999,0.61199999999999999,0.61]
[11,0.60799999999999998,0.60599999999999998,0.60399999999999998,0.60199999999999998,0.6,0.59799999999999998,0.59599999999999997,0.59499999999999997,0.59299999999999997,0.59099999999999997,0.58899999999999997,0.58699999999999997]
[12,0.58499999999999996,0.58299999999999996,0.58199999999999996,0.57999999999999996,0.57799999999999996,0.57599999999999996,0.57399999999999995,0.57299999999999995,0.57099999999999995,0.56899999999999995,0.56699999999999995,0.56599999999999995]
[13,0.56399999999999995]

{"sheet":"x-409","index":74,"n_rows":40,"n_cols":13,"rows_kept":40,"cut":false,"hidden":false,"merged":[]}
["Government Actuary's Department"]
[{"$f":"IF(title=\"> Enter workbook title here\",\"Enter workbook title in Cover sheet\",title)","v":"TPS (England & Wales) - Consolidated Factor Spreadsheet"}]
[{"$f":"TABLE_FACTOR_TYPE&\" - x-\"&TABLE_SERIES_NUMBER","v":"ERF - x-409"}]
[]
[]
["Data Item","Factor Table Information"]
["Client","TPS_EW"]
["Section","Career Average"]
["Factor Type","ERF"]
["Description","Benefits payable to the member on early retirement (with actuarial reduction)  - Career Average Section, deferred members, all NPAs, full retirement earned pension subject to buy out election"]
["Gender","Unisex"]
["Factor Age/Period Definition","Age/Completed months"]
["Section Number",0]
["Series Number",409]
["Table Reference","x-409"]
["Table Reference in Guidance","ER9"]
["Associated Guidance Note","Teachers' Pension Scheme: Final salary sections and career average section\nEarly retirements in normal health: Factors and guidance\nDate: 24 June 2019"]
["Date Factors Issued to Client","2023-06-30"]
["Date Factors Implemented (if known)"]
["Factor Status","Issued"]
[]
[null,{"$f":"HYPERLINK(\"#'Factor List'!A1\",\"Back to Factor List\")","v":"Back to Factor List"}]
[]
[]
["Age/Months",0,1,2,3,4,5,6,7,8,9,10,11]
[55,0.64800000000000002,0.65,0.65200000000000002,0.65400000000000003,0.65600000000000003,0.65800000000000003,0.66,0.66300000000000003,0.66500000000000004,0.66700000000000004,0.66900000000000004,0.67100000000000004]
[56,0.67300000000000004,0.67500000000000004,0.67800000000000005,0.68,0.68200000000000005,0.68400000000000005,0.68700000000000006,0.68899999999999995,0.69099999999999995,0.69299999999999995,0.69599999999999995,0.69799999999999995]
[57,0.7,0.70299999999999996,0.70499999999999996,0.70699999999999996,0.71,0.71199999999999997,0.71499999999999997,0.71699999999999997,0.71899999999999997,0.72199999999999998,0.72399999999999998,0.72699999999999998]
[58,0.72899999999999998,0.73199999999999998,0.73399999999999999,0.73699999999999999,0.73899999999999999,0.74199999999999999,0.74399999999999999,0.747,0.75,0.752,0.755,0.75700000000000001]
[59,0.76,0.76300000000000001,0.76600000000000001,0.76800000000000002,0.77100000000000002,0.77400000000000002,0.77700000000000002,0.77900000000000003,0.78200000000000003,0.78500000000000003,0.78800000000000003,0.79]
[60,0.79300000000000004,0.79600000000000004,0.79900000000000004,0.80200000000000005,0.80500000000000005,0.80800000000000005,0.81100000000000005,0.81399999999999995,0.81699999999999995,0.82,0.82299999999999995,0.82599999999999996]
[61,0.82899999999999996,0.83199999999999996,0.83499999999999996,0.83799999999999997,0.84199999999999997,0.84499999999999997,0.84799999999999998,0.85099999999999998,0.85399999999999998,0.85699999999999998,0.86099999999999999,0.86399999999999999]
[62,0.86699999999999999,0.871,0.874,0.877,0.88100000000000001,0.88400000000000001,0.88800000000000001,0.89100000000000001,0.89500000000000002,0.89800000000000002,0.90200000000000002,0.90500000000000003]
[63,0.90900000000000003,0.91200000000000003,0.91600000000000004,0.92,0.92400000000000004,0.92700000000000005,0.93100000000000005,0.93500000000000005,0.93799999999999994,0.94199999999999995,0.94599999999999995,0.95]
[64,0.95299999999999996,0.95799999999999996,0.96199999999999997,0.96599999999999997,0.97,0.97399999999999998,0.97799999999999998,0.98199999999999998,0.98599999999999999,0.99,0.99399999999999999,0.998]
[65,1,1,1,1,1,1,1,1,1,1,1,1]
[66,1,1,1,1,1,1,1,1,1,1,1,1]
[67,1,1,1,1,1,1,1,1,1,1,1,1]
[68,1,1,1,1,1,1,1,1,1,1,1,1]
[69,1]

{"sheet":"x-410","index":75,"n_rows":36,"n_cols":13,"rows_kept":36,"cut":false,"hidden":false,"merged":[]}
["Government Actuary's Department"]
[{"$f":"IF(title=\"> Enter workbook title here\",\"Enter workbook title in Cover sheet\",title)","v":"TPS (England & Wales) - Consolidated Factor Spreadsheet"}]
[{"$f":"TABLE_FACTOR_TYPE&\" - x-\"&TABLE_SERIES_NUMBER","v":"LRF - x-410"}]
[]
[]
["Data Item","Factor Table Information"]
["Client","TPS_EW"]
["Section","Final Salary"]
["Factor Type","LRF"]
["Description","Benefits payable to the member on late retirement (with actuarial uplift) - final salary section, NPA 65 members, main scheme pension"]
["Gender","Unisex"]
["Factor Age/Period Definition","Age/Completed months"]
["Section Number",1]
["Series Number",410]
["Table Reference","x-410"]
["Table Reference in Guidance","LR1"]
["Associated Guidance Note","Teachers' Pension Scheme: Final salary section\nLate retirements: Factors and guidance\nDate: 24 June 2019"]
["Date Factors Issued to Client","2023-06-30"]
["Date Factors Implemented (if known)"]
["Factor Status","Issued"]
[]
[null,{"$f":"HYPERLINK(\"#'Factor List'!A1\",\"Back to Factor List\")","v":"Back to Factor List"}]
[]
[]
["Age/Months",0,1,2,3,4,5,6,7,8,9,10,11]
[65,1.0009999999999999,1.004,1.0069999999999999,1.01,1.0129999999999999,1.0149999999999999,1.018,1.0209999999999999,1.024,1.026,1.0289999999999999,1.032]
[66,1.0349999999999999,1.038,1.0409999999999999,1.044,1.0469999999999999,1.05,1.0529999999999999,1.056,1.0589999999999999,1.0620000000000001,1.0649999999999999,1.0680000000000001]
[67,1.0720000000000001,1.075,1.0780000000000001,1.0820000000000001,1.085,1.0880000000000001,1.091,1.095,1.0980000000000001,1.101,1.105,1.1080000000000001]
[68,1.111,1.115,1.119,1.1220000000000001,1.1259999999999999,1.1299999999999999,1.133,1.137,1.1399999999999999,1.1439999999999999,1.1479999999999999,1.151]
[69,1.155,1.159,1.163,1.167,1.171,1.175,1.179,1.1830000000000001,1.1870000000000001,1.1910000000000001,1.1950000000000001,1.1990000000000001]
[70,1.2030000000000001,1.2070000000000001,1.212,1.216,1.2210000000000001,1.2250000000000001,1.2290000000000001,1.234,1.238,1.242,1.2470000000000001,1.2509999999999999]
[71,1.256,1.26,1.2649999999999999,1.27,1.2749999999999999,1.2789999999999999,1.284,1.2889999999999999,1.294,1.298,1.3029999999999999,1.3080000000000001]
[72,1.3129999999999999,1.3180000000000001,1.323,1.329,1.3340000000000001,1.339,1.3440000000000001,1.349,1.355,1.36,1.365,1.37]
[73,1.3759999999999999,1.381,1.387,1.393,1.3979999999999999,1.4039999999999999,1.41,1.4159999999999999,1.421,1.427,1.4330000000000001,1.4379999999999999]
[74,1.444,1.4510000000000001,1.4570000000000001,1.4630000000000001,1.4690000000000001,1.476,1.482,1.488,1.4950000000000001,1.5009999999999999,1.5069999999999999,1.5129999999999999]
[75,1.516]

{"sheet":"x-411","index":76,"n_rows":36,"n_cols":13,"rows_kept":36,"cut":false,"hidden":false,"merged":[]}
["Government Actuary's Department"]
[{"$f":"IF(title=\"> Enter workbook title here\",\"Enter workbook title in Cover sheet\",title)","v":"TPS (England & Wales) - Consolidated Factor Spreadsheet"}]
[{"$f":"TABLE_FACTOR_TYPE&\" - x-\"&TABLE_SERIES_NUMBER","v":"LRF - x-411"}]
[]
[]
["Data Item","Factor Table Information"]
["Client","TPS_EW"]
["Section","Final Salary"]
["Factor Type","LRF"]
["Description","Benefits payable to the member on late retirement (with actuarial uplift) - Final Salary Section, NPA 65 members, pension debits"]
["Gender","Unisex"]
["Factor Age/Period Definition","Age/Completed months"]
["Section Number",1]
["Series Number",411]
["Table Reference","x-411"]
["Table Reference in Guidance","LR2"]
["Associated Guidance Note","Teachers' Pension Scheme: Final salary section\nLate retirements: Factors and guidance\nDate: 24 June 2019"]
["Date Factors Issued to Client","2023-06-30"]
["Date Factors Implemented (if known)"]
["Factor Status","Issued"]
[]
[null,{"$f":"HYPERLINK(\"#'Factor List'!A1\",\"Back to Factor List\")","v":"Back to Factor List"}]
[]
[]
["Age/Months",0,1,2,3,4,5,6,7,8,9,10,11]
[65,1.002,1.006,1.0109999999999999,1.0149999999999999,1.0189999999999999,1.024,1.028,1.032,1.0369999999999999,1.0409999999999999,1.0449999999999999,1.05]
[66,1.054,1.0589999999999999,1.0629999999999999,1.0680000000000001,1.073,1.0780000000000001,1.0820000000000001,1.087,1.0920000000000001,1.0960000000000001,1.101,1.1060000000000001]
[67,1.111,1.1160000000000001,1.121,1.1259999999999999,1.131,1.1359999999999999,1.141,1.1459999999999999,1.1519999999999999,1.157,1.1619999999999999,1.167]
[68,1.1719999999999999,1.1779999999999999,1.1830000000000001,1.1890000000000001,1.1950000000000001,1.2,1.206,1.212,1.2170000000000001,1.2230000000000001,1.228,1.234]
[69,1.24,1.246,1.252,1.258,1.2649999999999999,1.2709999999999999,1.2769999999999999,1.2829999999999999,1.2889999999999999,1.2949999999999999,1.3009999999999999,1.3080000000000001]
[70,1.3140000000000001,1.321,1.3280000000000001,1.3340000000000001,1.341,1.3480000000000001,1.355,1.361,1.3680000000000001,1.375,1.3819999999999999,1.389]
[71,1.3959999999999999,1.403,1.41,1.4179999999999999,1.425,1.4330000000000001,1.44,1.448,1.4550000000000001,1.462,1.47,1.4770000000000001]
[72,1.4850000000000001,1.4930000000000001,1.5009999999999999,1.51,1.518,1.526,1.534,1.542,1.55,1.5589999999999999,1.5669999999999999,1.575]
[73,1.5840000000000001,1.593,1.6020000000000001,1.611,1.62,1.629,1.6379999999999999,1.647,1.6559999999999999,1.665,1.6739999999999999,1.6830000000000001]
[74,1.6919999999999999,1.702,1.712,1.722,1.732,1.742,1.752,1.762,1.772,1.782,1.792,1.8009999999999999]
[75,1.806]

{"sheet":"x-412","index":77,"n_rows":41,"n_cols":13,"rows_kept":41,"cut":false,"hidden":false,"merged":[]}
["Government Actuary's Department"]
[{"$f":"IF(title=\"> Enter workbook title here\",\"Enter workbook title in Cover sheet\",title)","v":"TPS (England & Wales) - Consolidated Factor Spreadsheet"}]
[{"$f":"TABLE_FACTOR_TYPE&\" - x-\"&TABLE_SERIES_NUMBER","v":"LRF - x-412"}]
[]
[]
["Data Item","Factor Table Information"]
["Client","TPS_EW"]
["Section","Final Salary"]
["Factor Type","LRF"]
["Description","Benefits payable to the member on late retirement (with actuarial uplift) - final salary section, NPA 60 members, annual allowance pension and lump sum debits"]
["Gender","Unisex"]
["Factor Age/Period Definition","Age/Completed months"]
["Section Number",1]
["Series Number",412]
["Table Reference","x-412"]
["Table Reference in Guidance","LR3"]
["Associated Guidance Note","Teachers' Pension Scheme: Final salary section\nLate retirements: Factors and guidance\nDate: 24 June 2019"]
["Date Factors Issued to Client","2023-06-30"]
["Date Factors Implemented (if known)"]
["Factor Status","Issued"]
[]
[null,{"$f":"HYPERLINK(\"#'Factor List'!A1\",\"Back to Factor List\")","v":"Back to Factor List"}]
[]
[]
["Age/Months",0,1,2,3,4,5,6,7,8,9,10,11]
[60,1.002,1.0049999999999999,1.0089999999999999,1.012,1.016,1.0189999999999999,1.022,1.026,1.0289999999999999,1.0329999999999999,1.036,1.04]
[61,1.0429999999999999,1.0469999999999999,1.0509999999999999,1.054,1.0580000000000001,1.0620000000000001,1.0660000000000001,1.069,1.073,1.077,1.08,1.0840000000000001]
[62,1.0880000000000001,1.0920000000000001,1.0960000000000001,1.1000000000000001,1.1040000000000001,1.1080000000000001,1.1120000000000001,1.1160000000000001,1.1200000000000001,1.1240000000000001,1.127,1.131]
[63,1.1359999999999999,1.1399999999999999,1.1439999999999999,1.1479999999999999,1.153,1.157,1.161,1.165,1.169,1.1739999999999999,1.1779999999999999,1.1819999999999999]
[64,1.1870000000000001,1.1910000000000001,1.196,1.2,1.2050000000000001,1.2090000000000001,1.214,1.2190000000000001,1.2230000000000001,1.228,1.232,1.2370000000000001]
[65,1.242,1.246,1.2509999999999999,1.256,1.2609999999999999,1.266,1.2709999999999999,1.276,1.2809999999999999,1.286,1.2909999999999999,1.296]
[66,1.3009999999999999,1.306,1.3109999999999999,1.3160000000000001,1.3220000000000001,1.327,1.3320000000000001,1.3380000000000001,1.343,1.3480000000000001,1.353,1.359]
[67,1.3640000000000001,1.37,1.375,1.381,1.387,1.393,1.3979999999999999,1.4039999999999999,1.41,1.415,1.421,1.427]
[68,1.4330000000000001,1.4390000000000001,1.4450000000000001,1.4510000000000001,1.4570000000000001,1.4630000000000001,1.4690000000000001,1.4750000000000001,1.482,1.488,1.494,1.5]
[69,1.506,1.5129999999999999,1.52,1.526,1.5329999999999999,1.5389999999999999,1.546,1.5529999999999999,1.5589999999999999,1.5660000000000001,1.573,1.579]
[70,1.5860000000000001,1.593,1.6,1.6080000000000001,1.615,1.6220000000000001,1.629,1.6359999999999999,1.643,1.65,1.6579999999999999,1.665]
[71,1.6719999999999999,1.68,1.6879999999999999,1.696,1.7030000000000001,1.7110000000000001,1.7190000000000001,1.726,1.734,1.742,1.75,1.7569999999999999]
[72,1.766,1.774,1.782,1.7909999999999999,1.7989999999999999,1.8080000000000001,1.8160000000000001,1.8240000000000001,1.833,1.841,1.85,1.8580000000000001]
[73,1.867,1.8759999999999999,1.885,1.8939999999999999,1.903,1.9119999999999999,1.921,1.93,1.94,1.9490000000000001,1.958,1.9670000000000001]
[74,1.976,1.986,1.996,2.0059999999999998,2.016,2.0259999999999998,2.036,2.0459999999999998,2.056,2.0649999999999999,2.0750000000000002,2.085]
[75,2.09]

{"sheet":"x-413","index":78,"n_rows":36,"n_cols":13,"rows_kept":36,"cut":false,"hidden":false,"merged":[]}
["Government Actuary's Department"]
[{"$f":"IF(title=\"> Enter workbook title here\",\"Enter workbook title in Cover sheet\",title)","v":"TPS_EW - Consolidated Factor Spreadsheet"}]
[{"$f":"TABLE_FACTOR_TYPE&\" - x-\"&TABLE_SERIES_NUMBER","v":"LRF - x-413"}]
[]
[]
["Data Item","Factor Table Information"]
["Client","TPS_EW"]
["Section","Career Average"]
["Factor Type","LRF"]
["Description","Benefits payable to the member on late retirement (with actuarial uplift) - Career Average Section, active members, all NPAs, full retirement earned pension"]
["Gender","Unisex"]
["Factor Age/Period Definition","Years/Completed months"]
["Section Number",0]
["Series Number",413]
["Table Reference","0-413"]
["Table Reference in Guidance","Table CLR1"]
["Associated Guidance Note","Teachers' Pension Scheme: Career Average section\nLate retirements: Factors and guidance\nDate: 10 February 2020"]
["Date Factors Issued to Client","2023-06-30"]
["Date Factors Implemented (if known)"]
["Factor Status","Issued"]
[]
[null,{"$f":"HYPERLINK(\"#'Factor List'!A1\",\"Back to Factor List\")","v":"Back to Factor List"},"These factors are based on the policy intent and are to be used in line with the TPS career average section late retirement factor guidance dated 10 February 2020. "]
[null,null,"We understand that the scheme rules are to be updated in due course to reflect the policy intent."]
[]
["Years/Months Late",0,1,2,3,4,5,6,7,8,9,10,11]
[0,1.0009999999999999,1.004,1.0069999999999999,1.01,1.0129999999999999,1.016,1.0189999999999999,1.022,1.0249999999999999,1.028,1.0309999999999999,1.034]
[1,1.0369999999999999,1.04,1.044,1.0469999999999999,1.05,1.0529999999999999,1.056,1.06,1.0629999999999999,1.0660000000000001,1.069,1.0720000000000001]
[2,1.0760000000000001,1.079,1.083,1.0860000000000001,1.0900000000000001,1.093,1.097,1.1000000000000001,1.1040000000000001,1.107,1.111,1.1140000000000001]
[3,1.1180000000000001,1.1220000000000001,1.1259999999999999,1.1299999999999999,1.133,1.137,1.141,1.145,1.149,1.153,1.1559999999999999,1.1599999999999999]
[4,1.1639999999999999,1.1679999999999999,1.173,1.177,1.181,1.1850000000000001,1.1890000000000001,1.194,1.198,1.202,1.206,1.21]
[5,1.2150000000000001,1.2190000000000001,1.224,1.2290000000000001,1.2330000000000001,1.238,1.242,1.2470000000000001,1.252,1.256,1.2609999999999999,1.2649999999999999]
[6,1.27,1.2749999999999999,1.28,1.2849999999999999,1.29,1.2949999999999999,1.3,1.3049999999999999,1.3109999999999999,1.3160000000000001,1.321,1.3260000000000001]
[7,1.331,1.3360000000000001,1.3420000000000001,1.347,1.353,1.3580000000000001,1.3640000000000001,1.369,1.375,1.38,1.3859999999999999,1.391]
[8,1.397,1.403,1.409,1.415,1.421,1.427,1.4330000000000001,1.4390000000000001,1.4450000000000001,1.4510000000000001,1.4570000000000001,1.464]
[9,1.47,1.476,1.4830000000000001,1.49,1.496,1.5029999999999999,1.51,1.516,1.5229999999999999,1.5289999999999999,1.536,1.5429999999999999]
[10,1.546]

{"sheet":"x-414","index":79,"n_rows":36,"n_cols":13,"rows_kept":36,"cut":false,"hidden":false,"merged":[]}
["Government Actuary's Department"]
[{"$f":"IF(title=\"> Enter workbook title here\",\"Enter workbook title in Cover sheet\",title)","v":"TPS_EW - Consolidated Factor Spreadsheet"}]
[{"$f":"TABLE_FACTOR_TYPE&\" - x-\"&TABLE_SERIES_NUMBER","v":"LRF - x-414"}]
[]
[]
["Data Item","Factor Table Information"]
["Client","TPS_EW"]
["Section","Career Average"]
["Factor Type","LRF"]
["Description","Benefits payable to the member on late retirement (with actuarial uplift) - Career average section, active members, all NPAs, pension sharing debits and annual allowance debits"]
["Gender","Unisex"]
["Factor Age/Period Definition","Years/Completed months"]
["Section Number",0]
["Series Number",414]
["Table Reference","0-414"]
["Table Reference in Guidance","Table CLR2"]
["Associated Guidance Note","Teachers' Pension Scheme: Career Average section\nLate retirements: Factors and guidance\nDate: 10 February 2020"]
["Date Factors Issued to Client","2023-06-30"]
["Date Factors Implemented (if known)"]
["Factor Status","Issued"]
[]
[null,{"$f":"HYPERLINK(\"#'Factor List'!A1\",\"Back to Factor List\")","v":"Back to Factor List"},"These factors are based on the policy intent and are to be used in line with the TPS career average section late retirement factor guidance dated 10 February 2020. "]
[null,null,"We understand that the scheme rules are to be updated in due course to reflect the policy intent."]
[]
["Years/Months Late",0,1,2,3,4,5,6,7,8,9,10,11]
[0,1.002,1.006,1.0109999999999999,1.0149999999999999,1.0189999999999999,1.024,1.028,1.032,1.0369999999999999,1.0409999999999999,1.0449999999999999,1.05]
[1,1.054,1.0589999999999999,1.0629999999999999,1.0680000000000001,1.073,1.0780000000000001,1.0820000000000001,1.087,1.0920000000000001,1.0960000000000001,1.101,1.1060000000000001]
[2,1.111,1.1160000000000001,1.121,1.1259999999999999,1.131,1.1359999999999999,1.141,1.1459999999999999,1.1519999999999999,1.157,1.1619999999999999,1.167]
[3,1.1719999999999999,1.1779999999999999,1.1830000000000001,1.1890000000000001,1.1950000000000001,1.2,1.206,1.212,1.2170000000000001,1.2230000000000001,1.228,1.234]
[4,1.24,1.246,1.252,1.258,1.2649999999999999,1.2709999999999999,1.2769999999999999,1.2829999999999999,1.2889999999999999,1.2949999999999999,1.3009999999999999,1.3080000000000001]
[5,1.3140000000000001,1.321,1.3280000000000001,1.3340000000000001,1.341,1.3480000000000001,1.355,1.361,1.3680000000000001,1.375,1.3819999999999999,1.389]
[6,1.3959999999999999,1.403,1.41,1.4179999999999999,1.425,1.4330000000000001,1.44,1.448,1.4550000000000001,1.462,1.47,1.4770000000000001]
[7,1.4850000000000001,1.4930000000000001,1.5009999999999999,1.51,1.518,1.526,1.534,1.542,1.55,1.5589999999999999,1.5669999999999999,1.575]
[8,1.5840000000000001,1.593,1.6020000000000001,1.611,1.62,1.629,1.6379999999999999,1.647,1.6559999999999999,1.665,1.6739999999999999,1.6830000000000001]
[9,1.6919999999999999,1.702,1.712,1.722,1.732,1.742,1.752,1.762,1.772,1.782,1.792,1.8009999999999999]
[10,1.806]

{"sheet":"x-501","index":80,"n_rows":71,"n_cols":2,"rows_kept":71,"cut":false,"hidden":false,"merged":[]}
["Government Actuary's Department"]
[{"$f":"IF(title=\"> Enter workbook title here\",\"Enter workbook title in Cover sheet\",title)","v":"TPS (England & Wales) - Consolidated Factor Spreadsheet"}]
[{"$f":"TABLE_FACTOR_TYPE&\" - x-\"&TABLE_SERIES_NUMBER","v":"Trivial Commutation - x-501"}]
[]
[]
["Data Item","Factor Table Information"]
["Client","TPS_EW"]
["Section","All"]
["Factor Type","Trivial Commutation"]
["Description","Trivial commutation factors for former contributing members"]
["Gender","Unisex"]
["Factor Age/Period Definition","Age last birthday"]
["Section Number",0]
["Series Number",501]
["Table Reference","x-501"]
["Table Reference in Guidance","Table A1"]
["Associated Guidance Note","Teachers' Pension Scheme: Final salary sections and career average section\nTrivial commutation: Factors and guidance\nDate: 24 June 2019"]
["Date Factors Issued to Client","2023-07-28"]
["Date Factors Implemented (if known)"]
["Factor Status","Issued"]
[]
[null,{"$f":"HYPERLINK(\"#'Factor List'!A1\",\"Back to Factor List\")","v":"Back to Factor List"}]
[]
[]
["Age","Factor"]
[55,26.3]
[56,25.7]
[57,25.1]
[58,24.6]
[59,24]
[60,23.4]
[61,22.8]
[62,22.1]
[63,21.5]
[64,20.9]
[65,20.2]
[66,19.600000000000001]
[67,19]
[68,18.3]
[69,17.7]
[70,17]
[71,16.3]
[72,15.7]
[73,15]
[74,14.4]
[75,13.7]
[76,13]
[77,12.4]
[78,11.8]
[79,11.2]
[80,10.5]
[81,10]
[82,9.5]
[83,9]
[84,8.4]
[85,8]
[86,7.6]
[87,7.2]
[88,6.9]
[89,6.5]
[90,6.2]
[91,6]
[92,5.8]
[93,5.7]
[94,5.5]
[95,5.4]
[96,5.3]
[97,5.2]
[98,5.2]
[99,5.0999999999999996]
[100,5.0999999999999996]

{"sheet":"x-502","index":81,"n_rows":106,"n_cols":2,"rows_kept":106,"cut":false,"hidden":false,"merged":[]}
["Government Actuary's Department"]
[{"$f":"IF(title=\"> Enter workbook title here\",\"Enter workbook title in Cover sheet\",title)","v":"TPS (England & Wales) - Consolidated Factor Spreadsheet"}]
[{"$f":"TABLE_FACTOR_TYPE&\" - x-\"&TABLE_SERIES_NUMBER","v":"Trivial Commutation - x-502"}]
[]
[]
["Data Item","Factor Table Information"]
["Client","TPS_EW"]
["Section","All"]
["Factor Type","Trivial Commutation"]
["Description","Trivial commutation factors for surviving dependants"]
["Gender","Unisex"]
["Factor Age/Period Definition","Age last birthday"]
["Section Number",0]
["Series Number",502]
["Table Reference","x-502"]
["Table Reference in Guidance","Table A2"]
["Associated Guidance Note","Teachers' Pension Scheme: Final salary sections and career average section\nTrivial commutation: Factors and guidance\nDate: 24 June 2019"]
["Date Factors Issued to Client","2023-07-28"]
["Date Factors Implemented (if known)"]
["Factor Status","Issued"]
[]
[null,{"$f":"HYPERLINK(\"#'Factor List'!A1\",\"Back to Factor List\")","v":"Back to Factor List"}]
[]
[]
["Age","Factor"]
[20,40.6]
[21,40.299999999999997]
[22,39.9]
[23,39.6]
[24,39.200000000000003]
[25,38.9]
[26,38.5]
[27,38.1]
[28,37.700000000000003]
[29,37.4]
[30,37]
[31,36.6]
[32,36.200000000000003]
[33,35.799999999999997]
[34,35.299999999999997]
[35,34.9]
[36,34.5]
[37,34]
[38,33.6]
[39,33.1]
[40,32.700000000000003]
[41,32.200000000000003]
[42,31.7]
[43,31.2]
[44,30.8]
[45,30.3]
[46,29.8]
[47,29.2]
[48,28.7]
[49,28.2]
[50,27.7]
[51,27.1]
[52,26.6]
[53,26]
[54,25.4]
[55,24.9]
[56,24.3]
[57,23.7]
[58,23.1]
[59,22.5]
[60,21.9]
[61,21.3]
[62,20.6]
[63,20]
[64,19.399999999999999]
[65,18.7]
[66,18.100000000000001]
[67,17.399999999999999]
[68,16.8]
[69,16.2]
[70,15.5]
[71,14.8]
[72,14.2]
[73,13.5]
[74,12.9]
[75,12.3]
[76,11.6]
[77,11]
[78,10.4]
[79,9.8000000000000007]
[80,9.1999999999999993]
[81,8.6]
[82,8.1]
[83,7.5]
[84,7]
[85,6.5]
[86,6]
[87,5.6]
[88,5.2]
[89,4.8]
[90,4.4000000000000004]
[91,4.0999999999999996]
[92,3.8]
[93,3.5]
[94,3.2]
[95,3]
[96,2.8]
[97,2.6]
[98,2.5]
[99,2.4]
[100,2.2999999999999998]

{"sheet":"x-503","index":82,"n_rows":71,"n_cols":2,"rows_kept":71,"cut":false,"hidden":false,"merged":[]}
["Government Actuary's Department"]
[{"$f":"IF(title=\"> Enter workbook title here\",\"Enter workbook title in Cover sheet\",title)","v":"TPS (England & Wales) - Consolidated Factor Spreadsheet"}]
[{"$f":"TABLE_FACTOR_TYPE&\" - x-\"&TABLE_SERIES_NUMBER","v":"Trivial Commutation - x-503"}]
[]
[]
["Data Item","Factor Table Information"]
["Client","TPS_EW"]
["Section","All"]
["Factor Type","Trivial Commutation"]
["Description","Trivial commutation factors for pension credit members"]
["Gender","Unisex"]
["Factor Age/Period Definition","Age last birthday"]
["Section Number",0]
["Series Number",503]
["Table Reference","x-503"]
["Table Reference in Guidance","Table A3"]
["Associated Guidance Note","Teachers' Pension Scheme: Final salary sections and career average section\nTrivial commutation: Factors and guidance\nDate: 24 June 2019"]
["Date Factors Issued to Client","2023-07-28"]
["Date Factors Implemented (if known)"]
["Factor Status","Issued"]
[]
[null,{"$f":"HYPERLINK(\"#'Factor List'!A1\",\"Back to Factor List\")","v":"Back to Factor List"}]
[]
[]
["Age","Factor"]
[55,24.9]
[56,24.3]
[57,23.7]
[58,23.1]
[59,22.5]
[60,21.9]
[61,21.3]
[62,20.7]
[63,20.100000000000001]
[64,19.399999999999999]
[65,18.8]
[66,18.2]
[67,17.5]
[68,16.899999999999999]
[69,16.3]
[70,15.6]
[71,15]
[72,14.4]
[73,13.7]
[74,13.1]
[75,12.5]
[76,11.9]
[77,11.3]
[78,10.7]
[79,10.199999999999999]
[80,9.6]
[81,9.1]
[82,8.6]
[83,8.1999999999999993]
[84,7.8]
[85,7.4]
[86,7]
[87,6.7]
[88,6.4]
[89,6.2]
[90,5.9]
[91,5.7]
[92,5.6]
[93,5.4]
[94,5.3]
[95,5.2]
[96,5.2]
[97,5.0999999999999996]
[98,5.0999999999999996]
[99,5]
[100,5]

{"sheet":"x-504","index":83,"n_rows":46,"n_cols":2,"rows_kept":46,"cut":false,"hidden":false,"merged":[]}
["Government Actuary's Department"]
[{"$f":"IF(title=\"> Enter workbook title here\",\"Enter workbook title in Cover sheet\",title)","v":"TPS (England & Wales) - Consolidated Factor Spreadsheet"}]
[{"$f":"TABLE_FACTOR_TYPE&\" - x-\"&TABLE_SERIES_NUMBER","v":"Inverse Commutation - x-504"}]
[]
[]
["Data Item","Factor Table Information"]
["Client","TPS_EW"]
["Section","All"]
["Factor Type","Inverse Commutation"]
["Description","Conversion factors for members over age 75"]
["Gender","Unisex"]
["Factor Age/Period Definition","Age last birthday"]
["Section Number",0]
["Series Number",504]
["Table Reference","x-504"]
["Table Reference in Guidance","Table A1"]
["Associated Guidance Note","Teachers' Pension Scheme: Final salary sections and career average section\nConversion of lump sum to pension: Factors and guidance\nDate: 24 June 2019"]
["Date Factors Issued to Client","2023-07-28"]
["Date Factors Implemented (if known)"]
["Factor Status","Issued"]
[]
[null,{"$f":"HYPERLINK(\"#'Factor List'!A1\",\"Back to Factor List\")","v":"Back to Factor List"}]
[]
[]
["Age","Factor"]
[75,13]
[76,12.3]
[77,11.7]
[78,11.1]
[79,10.6]
[80,10]
[81,9.5]
[82,9]
[83,8.5]
[84,8]
[85,7.6]
[86,7.2]
[87,6.9]
[88,6.6]
[89,6.3]
[90,6]
[91,5.8]
[92,5.6]
[93,5.5]
[94,5.4]
[95,5.3]

{"sheet":"x-505","index":84,"n_rows":45,"n_cols":2,"rows_kept":45,"cut":false,"hidden":false,"merged":[]}
["Government Actuary's Department"]
[{"$f":"IF(title=\"> Enter workbook title here\",\"Enter workbook title in Cover sheet\",title)","v":"TPS (England & Wales) - Consolidated Factor Spreadsheet"}]
[{"$f":"TABLE_FACTOR_TYPE&\" - x-\"&TABLE_SERIES_NUMBER","v":"Inverse Commutation - x-505"}]
[]
[]
["Data Item","Factor Table Information"]
["Client","TPS_EW"]
["Section","All"]
["Factor Type","Inverse Commutation"]
["Description","Lump sum conversion factors in lieu of repayment of contributions or any retirement lump sum above the permitted maximum"]
["Gender","Unisex"]
["Factor Age/Period Definition","Age last birthday"]
["Section Number",0]
["Series Number",505]
["Table Reference","x-505"]
["Table Reference in Guidance","Table A2"]
["Associated Guidance Note","Teachers' Pension Scheme: Final salary sections and career average section\nConversion of lump sum to pension: Factors and guidance\nDate: 24 June 2019"]
["Date Factors Issued to Client","2023-07-28"]
["Date Factors Implemented (if known)"]
["Factor Status","Issued"]
[]
[null,{"$f":"HYPERLINK(\"#'Factor List'!A1\",\"Back to Factor List\")","v":"Back to Factor List"}]
[]
[]
["Age","Factor"]
[55,25.4]
[56,24.9]
[57,24.3]
[58,23.7]
[59,23.1]
[60,22.5]
[61,21.9]
[62,21.2]
[63,20.6]
[64,20]
[65,19.399999999999999]
[66,18.7]
[67,18.100000000000001]
[68,17.399999999999999]
[69,16.8]
[70,16.2]
[71,15.5]
[72,14.9]
[73,14.2]
[74,13.6]

{"sheet":"x-601","index":85,"n_rows":80,"n_cols":3,"rows_kept":80,"cut":false,"hidden":false,"merged":[]}
["Government Actuary's Department"]
[{"$f":"IF(title=\"> Enter workbook title here\",\"Enter workbook title in Cover sheet\",title)","v":"TPS (England & Wales) - Consolidated Factor Spreadsheet"}]
[{"$f":"TABLE_FACTOR_TYPE&\" - x-\"&TABLE_SERIES_NUMBER","v":"Scheme pays AA - x-601"}]
[]
[]
["Data Item","Factor Table Information"]
["Client","TPS_EW"]
["Section","Final Salary"]
["Factor Type","Scheme pays AA"]
["Description","Factors for calculating annual allowance debit - NPA 60"]
["Gender","Unisex"]
["Factor Age/Period Definition","Age last birthday at relevant date"]
["Section Number",1]
["Series Number",601]
["Table Reference","x-601"]
["Table Reference in Guidance","Table 801"]
["Associated Guidance Note","Teachers' Pension Scheme: Final salary section\nAnnual allowance tax charge debits: Factors and guidance\nDate: 11 September 2019"]
["Date Factors Issued to Client","2023-07-28"]
["Date Factors Implemented (if known)"]
["Factor Status","Issued"]
[]
[null,{"$f":"HYPERLINK(\"#'Factor List'!A1\",\"Back to Factor List\")","v":"Back to Factor List"}]
[]
[]
["Age","Annual allowance debit factor per £1 of pension pa","Annual allowance debit factor per £1 of lump sum"]
[20,12.38,0.51]
[21,12.57,0.52]
[22,12.76,0.53]
[23,12.95,0.54]
[24,13.14,0.55000000000000004]
[25,13.34,0.56000000000000005]
[26,13.54,0.56999999999999995]
[27,13.75,0.57999999999999996]
[28,13.96,0.59]
[29,14.17,0.6]
[30,14.38,0.61]
[31,14.6,0.62]
[32,14.82,0.63]
[33,15.04,0.64]
[34,15.27,0.65]
[35,15.5,0.66]
[36,15.74,0.67]
[37,15.98,0.68]
[38,16.22,0.7]
[39,16.47,0.71]
[40,16.72,0.72]
[41,16.98,0.73]
[42,17.239999999999998,0.74]
[43,17.510000000000002,0.76]
[44,17.78,0.77]
[45,18.05,0.78]
[46,18.329999999999998,0.8]
[47,18.62,0.81]
[48,18.91,0.82]
[49,19.21,0.84]
[50,19.510000000000002,0.85]
[51,19.82,0.87]
[52,20.14,0.88]
[53,20.46,0.9]
[54,20.79,0.91]
[55,21.13,0.93]
[56,21.48,0.94]
[57,21.84,0.96]
[58,22.21,0.98]
[59,22.59,0.99]
[60,22.47,1]
[61,21.84,1]
[62,21.21,1]
[63,20.58,1]
[64,19.95,1]
[65,19.309999999999999,1]
[66,18.66,1]
[67,18.02,1]
[68,17.37,1]
[69,16.71,1]
[70,16.059999999999999,1]
[71,15.4,1]
[72,14.74,1]
[73,14.08,1]
[74,13.42,1]

{"sheet":"x-602","index":86,"n_rows":80,"n_cols":3,"rows_kept":80,"cut":false,"hidden":false,"merged":[]}
["Government Actuary's Department"]
[{"$f":"IF(title=\"> Enter workbook title here\",\"Enter workbook title in Cover sheet\",title)","v":"TPS (England & Wales) - Consolidated Factor Spreadsheet"}]
[{"$f":"TABLE_FACTOR_TYPE&\" - x-\"&TABLE_SERIES_NUMBER","v":"Scheme pays AA - x-602"}]
[]
[]
["Data Item","Factor Table Information"]
["Client","TPS_EW"]
["Section","Final Salary"]
["Factor Type","Scheme pays AA"]
["Description","Factors for calculating annual allowance debit - NPA 65"]
["Gender","Unisex"]
["Factor Age/Period Definition","Age last birthday at relevant date"]
["Section Number",1]
["Series Number",602]
["Table Reference","x-602"]
["Table Reference in Guidance","Table 811"]
["Associated Guidance Note","Teachers' Pension Scheme: Final salary section\nAnnual allowance tax charge debits: Factors and guidance\nDate: 11 September 2019"]
["Date Factors Issued to Client","2023-07-28"]
["Date Factors Implemented (if known)"]
["Factor Status","Issued"]
[]
[null,{"$f":"HYPERLINK(\"#'Factor List'!A1\",\"Back to Factor List\")","v":"Back to Factor List"}]
[]
[]
["Age","Annual allowance debit factor per £1 of pension pa","Annual allowance debit factor per £1 of lump sum"]
[20,9.99,0]
[21,10.130000000000001,0]
[22,10.28,0]
[23,10.43,0]
[24,10.59,0]
[25,10.74,0]
[26,10.9,0]
[27,11.06,0]
[28,11.22,0]
[29,11.39,0]
[30,11.55,0]
[31,11.72,0]
[32,11.89,0]
[33,12.07,0]
[34,12.25,0]
[35,12.43,0]
[36,12.61,0]
[37,12.8,0]
[38,12.99,0]
[39,13.18,0]
[40,13.37,0]
[41,13.57,0]
[42,13.77,0]
[43,13.98,0]
[44,14.19,0]
[45,14.4,0]
[46,14.62,0]
[47,14.84,0]
[48,15.06,0]
[49,15.29,0]
[50,15.52,0]
[51,15.76,0]
[52,16.010000000000002,0]
[53,16.260000000000002,0]
[54,16.510000000000002,0]
[55,16.77,0]
[56,17.04,0]
[57,17.309999999999999,0]
[58,17.600000000000001,0]
[59,17.89,0]
[60,18.190000000000001,0]
[61,18.5,0]
[62,18.82,0]
[63,19.16,0]
[64,19.510000000000002,0]
[65,19.36,0]
[66,18.7,0]
[67,18.04,0]
[68,17.38,0]
[69,16.72,0]
[70,16.059999999999999,0]
[71,15.4,0]
[72,14.74,0]
[73,14.08,0]
[74,13.42,0]

{"sheet":"x-603","index":87,"n_rows":66,"n_cols":13,"rows_kept":66,"cut":false,"hidden":false,"merged":[]}
["Government Actuary's Department"]
[{"$f":"IF(title=\"> Enter workbook title here\",\"Enter workbook title in Cover sheet\",title)","v":"TPS (England & Wales) - Consolidated Factor Spreadsheet"}]
[{"$f":"TABLE_FACTOR_TYPE&\" - x-\"&TABLE_SERIES_NUMBER","v":"Scheme pays AA - x-603"}]
[]
[]
["Data Item","Factor Table Information"]
["Client","TPS_EW"]
["Section","Final Salary"]
["Factor Type","Scheme pays AA"]
["Description","Timing adjustment on ill health retirements - NPA 60"]
["Gender","Unisex"]
["Factor Age/Period Definition","Age (years/completed months)"]
["Section Number",1]
["Series Number",603]
["Table Reference","x-603"]
["Table Reference in Guidance","Table 841"]
["Associated Guidance Note","Teachers' Pension Scheme: Final salary section\nAnnual allowance tax charge debits: Factors and guidance\nDate: 11 September 2019"]
["Date Factors Issued to Client","2023-07-28"]
["Date Factors Implemented (if known)"]
["Factor Status","Issued"]
[]
[null,{"$f":"HYPERLINK(\"#'Factor List'!A1\",\"Back to Factor List\")","v":"Back to Factor List"}]
[]
[]
["Age/Months",0,1,2,3,4,5,6,7,8,9,10,11]
[20,0.253,0.253,0.254,0.255,0.255,0.25600000000000001,0.25600000000000001,0.25700000000000001,0.25700000000000001,0.25800000000000001,0.25900000000000001,0.25900000000000001]
[21,0.26,0.26,0.26100000000000001,0.26100000000000001,0.26200000000000001,0.26300000000000001,0.26300000000000001,0.26400000000000001,0.26400000000000001,0.26500000000000001,0.26600000000000001,0.26600000000000001]
[22,0.26700000000000002,0.26700000000000002,0.26800000000000002,0.26900000000000002,0.26900000000000002,0.27,0.27,0.27100000000000002,0.27200000000000002,0.27200000000000002,0.27300000000000002,0.27300000000000002]
[23,0.27400000000000002,0.27500000000000002,0.27500000000000002,0.27600000000000002,0.27700000000000002,0.27700000000000002,0.27800000000000002,0.27800000000000002,0.27900000000000003,0.28000000000000003,0.28000000000000003,0.28100000000000003]
[24,0.28199999999999997,0.28199999999999997,0.28299999999999997,0.28399999999999997,0.28399999999999997,0.28499999999999998,0.28599999999999998,0.28599999999999998,0.28699999999999998,0.28799999999999998,0.28799999999999998,0.28899999999999998]
[25,0.28899999999999998,0.28999999999999998,0.29099999999999998,0.29199999999999998,0.29199999999999998,0.29299999999999998,0.29399999999999998,0.29399999999999998,0.29499999999999998,0.29599999999999999,0.29599999999999999,0.29699999999999999]
[26,0.29799999999999999,0.29799999999999999,0.29899999999999999,0.3,0.30099999999999999,0.30099999999999999,0.30199999999999999,0.30299999999999999,0.30299999999999999,0.30399999999999999,0.30499999999999999,0.30499999999999999]
[27,0.30599999999999999,0.307,0.308,0.308,0.309,0.31,0.311,0.311,0.312,0.313,0.314,0.314]
[28,0.315,0.316,0.317,0.317,0.318,0.31900000000000001,0.32,0.32,0.32100000000000001,0.32200000000000001,0.32300000000000001,0.32400000000000001]
[29,0.32400000000000001,0.32500000000000001,0.32600000000000001,0.32700000000000001,0.32700000000000001,0.32800000000000001,0.32900000000000001,0.33,0.33100000000000002,0.33100000000000002,0.33200000000000002,0.33300000000000002]
[30,0.33400000000000002,0.33500000000000002,0.33600000000000002,0.33600000000000002,0.33700000000000002,0.33800000000000002,0.33900000000000002,0.34,0.34100000000000003,0.34100000000000003,0.34200000000000003,0.34300000000000003]
[31,0.34399999999999997,0.34499999999999997,0.34599999999999997,0.34699999999999998,0.34699999999999998,0.34799999999999998,0.34899999999999998,0.35,0.35099999999999998,0.35199999999999998,0.35299999999999998,0.35299999999999998]
[32,0.35399999999999998,0.35499999999999998,0.35599999999999998,0.35699999999999998,0.35799999999999998,0.35899999999999999,0.36,0.36099999999999999,0.36199999999999999,0.36199999999999999,0.36299999999999999,0.36399999999999999]
[33,0.36499999999999999,0.36599999999999999,0.36699999999999999,0.36799999999999999,0.36899999999999999,0.37,0.371,0.372,0.373,0.374,0.375,0.376]
[34,0.377,0.378,0.379,0.38,0.38100000000000001,0.38100000000000001,0.38200000000000001,0.38300000000000001,0.38400000000000001,0.38500000000000001,0.38600000000000001,0.38700000000000001]
[35,0.38800000000000001,0.38900000000000001,0.39,0.39100000000000001,0.39300000000000002,0.39400000000000002,0.39500000000000002,0.39600000000000002,0.39700000000000002,0.39800000000000002,0.39900000000000002,0.4]
[36,0.40100000000000002,0.40200000000000002,0.40300000000000002,0.40400000000000003,0.40500000000000003,0.40600000000000003,0.40699999999999997,0.40799999999999997,0.40899999999999997,0.41,0.41199999999999998,0.41299999999999998]
[37,0.41399999999999998,0.41499999999999998,0.41599999999999998,0.41699999999999998,0.41799999999999998,0.41899999999999998,0.42,0.42199999999999999,0.42299999999999999,0.42399999999999999,0.42499999999999999,0.42599999999999999]
[38,0.42699999999999999,0.42799999999999999,0.43,0.43099999999999999,0.432,0.433,0.434,0.435,0.437,0.438,0.439,0.44]
[39,0.441,0.443,0.44400000000000001,0.44500000000000001,0.44600000000000001,0.44700000000000001,0.44900000000000001,0.45,0.45100000000000001,0.45200000000000001,0.45400000000000001,0.45500000000000002]
[40,0.45600000000000002,0.45700000000000002,0.45900000000000002,0.46,0.46100000000000002,0.46200000000000002,0.46400000000000002,0.46500000000000002,0.46600000000000003,0.46800000000000003,0.46899999999999997,0.47]
[41,0.47199999999999998,0.47299999999999998,0.47399999999999998,0.47599999999999998,0.47699999999999998,0.47799999999999998,0.48,0.48099999999999998,0.48199999999999998,0.48399999999999999,0.48499999999999999,0.48599999999999999]
[42,0.48799999999999999,0.48899999999999999,0.49099999999999999,0.49199999999999999,0.49299999999999999,0.495,0.496,0.498,0.499,0.5,0.502,0.503]
[43,0.505,0.50600000000000001,0.50800000000000001,0.50900000000000001,0.51100000000000001,0.51200000000000001,0.51400000000000001,0.51500000000000001,0.51700000000000002,0.51800000000000002,0.52,0.52100000000000002]
[44,0.52300000000000002,0.52400000000000002,0.52600000000000002,0.52700000000000002,0.52900000000000003,0.53,0.53200000000000003,0.53400000000000003,0.53500000000000003,0.53700000000000003,0.53800000000000003,0.54]
[45,0.54100000000000004,0.54300000000000004,0.54500000000000004,0.54600000000000004,0.54800000000000004,0.55000000000000004,0.55100000000000005,0.55300000000000005,0.55400000000000005,0.55600000000000005,0.55800000000000005,0.55900000000000005]
[46,0.56100000000000005,0.56299999999999994,0.56499999999999995,0.56599999999999995,0.56799999999999995,0.56999999999999995,0.57099999999999995,0.57299999999999995,0.57499999999999996,0.57699999999999996,0.57799999999999996,0.57999999999999996]
[47,0.58199999999999996,0.58399999999999996,0.58599999999999997,0.58699999999999997,0.58899999999999997,0.59099999999999997,0.59299999999999997,0.59499999999999997,0.59699999999999998,0.59799999999999998,0.6,0.60199999999999998]
[48,0.60399999999999998,0.60599999999999998,0.60799999999999998,0.61,0.61199999999999999,0.61299999999999999,0.61499999999999999,0.61699999999999999,0.61899999999999999,0.621,0.623,0.625]
[49,0.627,0.629,0.63100000000000001,0.63300000000000001,0.63500000000000001,0.63700000000000001,0.63900000000000001,0.64100000000000001,0.64300000000000002,0.64500000000000002,0.64700000000000002,0.64900000000000002]
[50,0.65200000000000002,0.65400000000000003,0.65600000000000003,0.65800000000000003,0.66,0.66200000000000003,0.66400000000000003,0.66700000000000004,0.66900000000000004,0.67100000000000004,0.67300000000000004,0.67500000000000004]
[51,0.67700000000000005,0.68,0.68200000000000005,0.68400000000000005,0.68700000000000006,0.68899999999999995,0.69099999999999995,0.69299999999999995,0.69599999999999995,0.69799999999999995,0.7,0.70299999999999996]
[52,0.70499999999999996,0.70699999999999996,0.71,0.71199999999999997,0.71499999999999997,0.71699999999999997,0.72,0.72199999999999998,0.72399999999999998,0.72699999999999998,0.72899999999999998,0.73199999999999998]
[53,0.73399999999999999,0.73699999999999999,0.73899999999999999,0.74199999999999999,0.745,0.747,0.75,0.752,0.755,0.75700000000000001,0.76,0.76300000000000001]
[54,0.76500000000000001,0.76800000000000002,0.77100000000000002,0.77400000000000002,0.77600000000000002,0.77900000000000003,0.78200000000000003,0.78500000000000003,0.78700000000000003,0.79,0.79300000000000004,0.79600000000000004]
[55,0.79800000000000004,0.80100000000000005,0.80400000000000005,0.80700000000000005,0.81,0.81299999999999994,0.81599999999999995,0.81899999999999995,0.82199999999999995,0.82499999999999996,0.82799999999999996,0.83099999999999996]
[56,0.83399999999999996,0.83699999999999997,0.84,0.84299999999999997,0.84599999999999997,0.84899999999999998,0.85199999999999998,0.85599999999999998,0.85899999999999999,0.86199999999999999,0.86499999999999999,0.86799999999999999]
[57,0.871,0.875,0.878,0.88200000000000001,0.88500000000000001,0.88800000000000001,0.89200000000000002,0.89500000000000002,0.89800000000000002,0.90200000000000002,0.90500000000000003,0.90800000000000003]
[58,0.91200000000000003,0.91500000000000004,0.91900000000000004,0.92300000000000004,0.92600000000000005,0.93,0.93400000000000005,0.93700000000000006,0.94099999999999995,0.94399999999999995,0.94799999999999995,0.95199999999999996]
[59,0.95499999999999996,0.95899999999999996,0.96299999999999997,0.96699999999999997,0.97099999999999997,0.97499999999999998,0.97899999999999998,0.98299999999999998,0.98599999999999999,0.99,0.99399999999999999,0.998]
[60,1]

{"sheet":"x-604","index":88,"n_rows":71,"n_cols":13,"rows_kept":71,"cut":false,"hidden":false,"merged":[]}
["Government Actuary's Department"]
[{"$f":"IF(title=\"> Enter workbook title here\",\"Enter workbook title in Cover sheet\",title)","v":"TPS (England & Wales) - Consolidated Factor Spreadsheet"}]
[{"$f":"TABLE_FACTOR_TYPE&\" - x-\"&TABLE_SERIES_NUMBER","v":"Scheme pays AA - x-604"}]
[]
[]
["Data Item","Factor Table Information"]
["Client","TPS_EW"]
["Section","Final Salary"]
["Factor Type","Scheme pays AA"]
["Description","Timing adjustment on ill health retirements - NPA 65"]
["Gender","Unisex"]
["Factor Age/Period Definition","Age (years/completed months)"]
["Section Number",1]
["Series Number",604]
["Table Reference","x-604"]
["Table Reference in Guidance","Table 851"]
["Associated Guidance Note","Teachers' Pension Scheme: Final salary section\nAnnual allowance tax charge debits: Factors and guidance\nDate: 11 September 2019"]
["Date Factors Issued to Client","2023-07-28"]
["Date Factors Implemented (if known)"]
["Factor Status","Issued"]
[]
[null,{"$f":"HYPERLINK(\"#'Factor List'!A1\",\"Back to Factor List\")","v":"Back to Factor List"}]
[]
[]
["Age/Months",0,1,2,3,4,5,6,7,8,9,10,11]
[20,0.20100000000000001,0.20200000000000001,0.20200000000000001,0.20200000000000001,0.20300000000000001,0.20300000000000001,0.20399999999999999,0.20399999999999999,0.20499999999999999,0.20499999999999999,0.20499999999999999,0.20599999999999999]
[21,0.20599999999999999,0.20699999999999999,0.20699999999999999,0.20799999999999999,0.20799999999999999,0.20899999999999999,0.20899999999999999,0.21,0.21,0.21,0.21099999999999999,0.21099999999999999]
[22,0.21199999999999999,0.21199999999999999,0.21299999999999999,0.21299999999999999,0.214,0.214,0.215,0.215,0.216,0.216,0.217,0.217]
[23,0.217,0.218,0.218,0.219,0.219,0.22,0.22,0.221,0.221,0.222,0.222,0.223]
[24,0.223,0.224,0.224,0.22500000000000001,0.22500000000000001,0.22600000000000001,0.22600000000000001,0.22700000000000001,0.22700000000000001,0.22800000000000001,0.22800000000000001,0.22900000000000001]
[25,0.22900000000000001,0.23,0.23100000000000001,0.23100000000000001,0.23200000000000001,0.23200000000000001,0.23300000000000001,0.23300000000000001,0.23400000000000001,0.23400000000000001,0.23499999999999999,0.23499999999999999]
[26,0.23599999999999999,0.23599999999999999,0.23699999999999999,0.23699999999999999,0.23799999999999999,0.23899999999999999,0.23899999999999999,0.24,0.24,0.24099999999999999,0.24099999999999999,0.24199999999999999]
[27,0.24199999999999999,0.24299999999999999,0.24399999999999999,0.24399999999999999,0.245,0.245,0.246,0.246,0.247,0.248,0.248,0.249]
[28,0.249,0.25,0.25,0.251,0.252,0.252,0.253,0.253,0.254,0.255,0.255,0.25600000000000001]
[29,0.25600000000000001,0.25700000000000001,0.25800000000000001,0.25800000000000001,0.25900000000000001,0.26,0.26,0.26100000000000001,0.26100000000000001,0.26200000000000001,0.26300000000000001,0.26300000000000001]
[30,0.26400000000000001,0.26500000000000001,0.26500000000000001,0.26600000000000001,0.26600000000000001,0.26700000000000002,0.26800000000000002,0.26800000000000002,0.26900000000000002,0.27,0.27,0.27100000000000002]
[31,0.27200000000000002,0.27200000000000002,0.27300000000000002,0.27400000000000002,0.27400000000000002,0.27500000000000002,0.27600000000000002,0.27600000000000002,0.27700000000000002,0.27800000000000002,0.27800000000000002,0.27900000000000003]
[32,0.28000000000000003,0.28000000000000003,0.28100000000000003,0.28199999999999997,0.28199999999999997,0.28299999999999997,0.28399999999999997,0.28499999999999998,0.28499999999999998,0.28599999999999998,0.28699999999999998,0.28699999999999998]
[33,0.28799999999999998,0.28899999999999998,0.28999999999999998,0.28999999999999998,0.29099999999999998,0.29199999999999998,0.29199999999999998,0.29299999999999998,0.29399999999999998,0.29499999999999998,0.29499999999999998,0.29599999999999999]
[34,0.29699999999999999,0.29799999999999999,0.29799999999999999,0.29899999999999999,0.3,0.30099999999999999,0.30099999999999999,0.30199999999999999,0.30299999999999999,0.30399999999999999,0.30399999999999999,0.30499999999999999]
[35,0.30599999999999999,0.307,0.308,0.308,0.309,0.31,0.311,0.312,0.312,0.313,0.314,0.315]
[36,0.316,0.316,0.317,0.318,0.31900000000000001,0.32,0.32,0.32100000000000001,0.32200000000000001,0.32300000000000001,0.32400000000000001,0.32500000000000001]
[37,0.32500000000000001,0.32600000000000001,0.32700000000000001,0.32800000000000001,0.32900000000000001,0.33,0.33100000000000002,0.33200000000000002,0.33200000000000002,0.33300000000000002,0.33400000000000002,0.33500000000000002]
[38,0.33600000000000002,0.33700000000000002,0.33800000000000002,0.33900000000000002,0.33900000000000002,0.34,0.34100000000000003,0.34200000000000003,0.34300000000000003,0.34399999999999997,0.34499999999999997,0.34599999999999997]
[39,0.34699999999999998,0.34799999999999998,0.34899999999999998,0.35,0.35099999999999998,0.35099999999999998,0.35199999999999998,0.35299999999999998,0.35399999999999998,0.35499999999999998,0.35599999999999998,0.35699999999999998]
[40,0.35799999999999998,0.35899999999999999,0.36,0.36099999999999999,0.36199999999999999,0.36299999999999999,0.36399999999999999,0.36499999999999999,0.36599999999999999,0.36699999999999999,0.36799999999999999,0.36899999999999999]
[41,0.37,0.371,0.372,0.373,0.374,0.375,0.376,0.377,0.378,0.379,0.38,0.38100000000000001]
[42,0.38200000000000001,0.38300000000000001,0.38500000000000001,0.38600000000000001,0.38700000000000001,0.38800000000000001,0.38900000000000001,0.39,0.39100000000000001,0.39200000000000002,0.39300000000000002,0.39400000000000002]
[43,0.39500000000000002,0.39700000000000002,0.39800000000000002,0.39900000000000002,0.4,0.40100000000000002,0.40200000000000002,0.40300000000000002,0.40500000000000003,0.40600000000000003,0.40699999999999997,0.40799999999999997]
[44,0.40899999999999997,0.41,0.41199999999999998,0.41299999999999998,0.41399999999999998,0.41499999999999998,0.41599999999999998,0.41799999999999998,0.41899999999999998,0.42,0.42099999999999999,0.42199999999999999]
[45,0.42399999999999999,0.42499999999999999,0.42599999999999999,0.42699999999999999,0.42899999999999999,0.43,0.43099999999999999,0.432,0.434,0.435,0.436,0.437]
[46,0.439,0.44,0.441,0.443,0.44400000000000001,0.44500000000000001,0.44700000000000001,0.44800000000000001,0.44900000000000001,0.45100000000000001,0.45200000000000001,0.45300000000000001]
[47,0.45500000000000002,0.45600000000000002,0.45700000000000002,0.45900000000000002,0.46,0.46200000000000002,0.46300000000000002,0.46400000000000002,0.46600000000000003,0.46700000000000003,0.46899999999999997,0.47]
[48,0.47099999999999997,0.47299999999999998,0.47399999999999998,0.47599999999999998,0.47699999999999998,0.47899999999999998,0.48,0.48199999999999998,0.48299999999999998,0.48499999999999999,0.48599999999999999,0.48799999999999999]
[49,0.48899999999999999,0.49099999999999999,0.49199999999999999,0.49399999999999999,0.495,0.497,0.499,0.5,0.502,0.503,0.505,0.50600000000000001]
[50,0.50800000000000001,0.51,0.51100000000000001,0.51300000000000001,0.51400000000000001,0.51600000000000001,0.51800000000000002,0.51900000000000002,0.52100000000000002,0.52300000000000002,0.52400000000000002,0.52600000000000002]
[51,0.52800000000000002,0.52900000000000003,0.53100000000000003,0.53300000000000003,0.53500000000000003,0.53600000000000003,0.53800000000000003,0.54,0.54200000000000004,0.54300000000000004,0.54500000000000004,0.54700000000000004]
[52,0.54900000000000004,0.55100000000000005,0.55200000000000005,0.55400000000000005,0.55600000000000005,0.55800000000000005,0.56000000000000005,0.56200000000000006,0.56399999999999995,0.56499999999999995,0.56699999999999995,0.56899999999999995]
[53,0.57099999999999995,0.57299999999999995,0.57499999999999996,0.57699999999999996,0.57899999999999996,0.58099999999999996,0.58299999999999996,0.58499999999999996,0.58699999999999997,0.58899999999999997,0.59099999999999997,0.59299999999999997]
[54,0.59499999999999997,0.59699999999999998,0.59899999999999998,0.60099999999999998,0.60299999999999998,0.60499999999999998,0.60699999999999998,0.60899999999999999,0.61199999999999999,0.61399999999999999,0.61599999999999999,0.61799999999999999]
[55,0.62,0.622,0.624,0.627,0.629,0.63100000000000001,0.63300000000000001,0.63600000000000001,0.63800000000000001,0.64,0.64200000000000002,0.64500000000000002]
[56,0.64700000000000002,0.64900000000000002,0.65200000000000002,0.65400000000000003,0.65700000000000003,0.65900000000000003,0.66100000000000003,0.66400000000000003,0.66600000000000004,0.66800000000000004,0.67100000000000004,0.67300000000000004]
[57,0.67600000000000005,0.67800000000000005,0.68100000000000005,0.68300000000000005,0.68600000000000005,0.68899999999999995,0.69099999999999995,0.69399999999999995,0.69599999999999995,0.69899999999999995,0.70099999999999996,0.70399999999999996]
[58,0.70699999999999996,0.70899999999999996,0.71199999999999997,0.71499999999999997,0.71799999999999997,0.72,0.72299999999999998,0.72599999999999998,0.72899999999999998,0.73099999999999998,0.73399999999999999,0.73699999999999999]
[59,0.74,0.74299999999999999,0.746,0.749,0.752,0.754,0.75700000000000001,0.76,0.76300000000000001,0.76600000000000001,0.76900000000000002,0.77200000000000002]
[60,0.77500000000000002,0.77800000000000002,0.78200000000000003,0.78500000000000003,0.78800000000000003,0.79100000000000004,0.79400000000000004,0.79800000000000004,0.80100000000000005,0.80400000000000005,0.80700000000000005,0.81]
[61,0.81399999999999995,0.81699999999999995,0.82099999999999995,0.82399999999999995,0.82699999999999996,0.83099999999999996,0.83399999999999996,0.83799999999999997,0.84099999999999997,0.84499999999999997,0.84799999999999998,0.85199999999999998]
[62,0.85499999999999998,0.85899999999999999,0.86299999999999999,0.86599999999999999,0.87,0.874,0.878,0.88100000000000001,0.88500000000000001,0.88900000000000001,0.89300000000000002,0.89600000000000002]
[63,0.9,0.90400000000000003,0.90800000000000003,0.91200000000000003,0.91600000000000004,0.92,0.92500000000000004,0.92900000000000005,0.93300000000000005,0.93700000000000006,0.94099999999999995,0.94499999999999995]
[64,0.94899999999999995,0.95399999999999996,0.95799999999999996,0.96199999999999997,0.96699999999999997,0.97099999999999997,0.97599999999999998,0.98,0.98499999999999999,0.98899999999999999,0.99299999999999999,0.998]
[65,1]

{"sheet":"x-605","index":89,"n_rows":80,"n_cols":2,"rows_kept":80,"cut":false,"hidden":false,"merged":[]}
["Government Actuary's Department"]
[{"$f":"IF(title=\"> Enter workbook title here\",\"Enter workbook title in Cover sheet\",title)","v":"TPS (England & Wales) - Consolidated Factor Spreadsheet"}]
[{"$f":"TABLE_FACTOR_TYPE&\" - x-\"&TABLE_SERIES_NUMBER","v":"Scheme pays AA - x-605"}]
[]
[]
["Data Item","Factor Table Information"]
["Client","TPS_EW"]
["Section","Career Average"]
["Factor Type","Scheme pays AA"]
["Description","Factors for calculating annual allowance debit - NPA 65"]
["Gender","Unisex"]
["Factor Age/Period Definition","Age last birthday at relevant date"]
["Section Number",0]
["Series Number",605]
["Table Reference","x-605"]
["Table Reference in Guidance","Table CSP65a"]
["Associated Guidance Note","Teachers' Pension Scheme: Career average section\nAnnual allowance tax charge debits: Factors and guidance\nDate: 11 September 2019"]
["Date Factors Issued to Client","2023-07-28"]
["Date Factors Implemented (if known)"]
["Factor Status","Issued"]
[]
[null,{"$f":"HYPERLINK(\"#'Factor List'!A1\",\"Back to Factor List\")","v":"Back to Factor List"}]
[]
[]
["Age","Annual allowance debit factor per 1 of pension pa"]
[20,9.99]
[21,10.130000000000001]
[22,10.28]
[23,10.43]
[24,10.59]
[25,10.74]
[26,10.9]
[27,11.06]
[28,11.22]
[29,11.39]
[30,11.55]
[31,11.72]
[32,11.89]
[33,12.07]
[34,12.25]
[35,12.43]
[36,12.61]
[37,12.8]
[38,12.99]
[39,13.18]
[40,13.37]
[41,13.57]
[42,13.77]
[43,13.98]
[44,14.19]
[45,14.4]
[46,14.62]
[47,14.84]
[48,15.06]
[49,15.29]
[50,15.52]
[51,15.76]
[52,16.010000000000002]
[53,16.260000000000002]
[54,16.510000000000002]
[55,16.77]
[56,17.04]
[57,17.309999999999999]
[58,17.600000000000001]
[59,17.89]
[60,18.190000000000001]
[61,18.5]
[62,18.82]
[63,19.16]
[64,19.510000000000002]
[65,19.36]
[66,18.7]
[67,18.04]
[68,17.38]
[69,16.72]
[70,16.059999999999999]
[71,15.4]
[72,14.74]
[73,14.08]
[74,13.42]

{"sheet":"x-606","index":90,"n_rows":80,"n_cols":2,"rows_kept":80,"cut":false,"hidden":false,"merged":[]}
["Government Actuary's Department"]
[{"$f":"IF(title=\"> Enter workbook title here\",\"Enter workbook title in Cover sheet\",title)","v":"TPS (England & Wales) - Consolidated Factor Spreadsheet"}]
[{"$f":"TABLE_FACTOR_TYPE&\" - x-\"&TABLE_SERIES_NUMBER","v":"Scheme pays AA - x-606"}]
[]
[]
["Data Item","Factor Table Information"]
["Client","TPS_EW"]
["Section","Career Average"]
["Factor Type","Scheme pays AA"]
["Description","Factors for calculating annual allowance debit - NPA 66"]
["Gender","Unisex"]
["Factor Age/Period Definition","Age last birthday at relevant date"]
["Section Number",0]
["Series Number",606]
["Table Reference","x-606"]
["Table Reference in Guidance","Table CSP66a"]
["Associated Guidance Note","Teachers' Pension Scheme: Career average section\nAnnual allowance tax charge debits: Factors and guidance\nDate: 11 September 2019"]
["Date Factors Issued to Client","2023-07-28"]
["Date Factors Implemented (if known)"]
["Factor Status","Issued"]
[]
[null,{"$f":"HYPERLINK(\"#'Factor List'!A1\",\"Back to Factor List\")","v":"Back to Factor List"}]
[]
[]
["Age","Annual allowance debit factor per £1 of pension pa"]
[20,9.5399999999999991]
[21,9.68]
[22,9.82]
[23,9.9600000000000009]
[24,10.1]
[25,10.25]
[26,10.4]
[27,10.55]
[28,10.7]
[29,10.86]
[30,11.02]
[31,11.18]
[32,11.34]
[33,11.51]
[34,11.68]
[35,11.85]
[36,12.02]
[37,12.2]
[38,12.37]
[39,12.56]
[40,12.74]
[41,12.93]
[42,13.12]
[43,13.31]
[44,13.51]
[45,13.71]
[46,13.92]
[47,14.12]
[48,14.34]
[49,14.55]
[50,14.77]
[51,15]
[52,15.23]
[53,15.46]
[54,15.7]
[55,15.95]
[56,16.2]
[57,16.46]
[58,16.73]
[59,17]
[60,17.29]
[61,17.579999999999998]
[62,17.88]
[63,18.2]
[64,18.53]
[65,18.87]
[66,18.72]
[67,18.05]
[68,17.39]
[69,16.72]
[70,16.059999999999999]
[71,15.4]
[72,14.74]
[73,14.08]
[74,13.42]

{"sheet":"x-607","index":91,"n_rows":80,"n_cols":2,"rows_kept":80,"cut":false,"hidden":false,"merged":[]}
["Government Actuary's Department"]
[{"$f":"IF(title=\"> Enter workbook title here\",\"Enter workbook title in Cover sheet\",title)","v":"TPS (England & Wales) - Consolidated Factor Spreadsheet"}]
[{"$f":"TABLE_FACTOR_TYPE&\" - x-\"&TABLE_SERIES_NUMBER","v":"Scheme pays AA - x-607"}]
[]
[]
["Data Item","Factor Table Information"]
["Client","TPS_EW"]
["Section","Career Average"]
["Factor Type","Scheme pays AA"]
["Description","Factors for calculating annual allowance debit - NPA 67"]
["Gender","Unisex"]
["Factor Age/Period Definition","Age last birthday at relevant date"]
["Section Number",0]
["Series Number",607]
["Table Reference","x-607"]
["Table Reference in Guidance","Table CSP67a"]
["Associated Guidance Note","Teachers' Pension Scheme: Career average section\nAnnual allowance tax charge debits: Factors and guidance\nDate: 11 September 2019"]
["Date Factors Issued to Client","2023-07-28"]
["Date Factors Implemented (if known)"]
["Factor Status","Issued"]
[]
[null,{"$f":"HYPERLINK(\"#'Factor List'!A1\",\"Back to Factor List\")","v":"Back to Factor List"}]
[]
[]
["Age","Annual allowance debit factor per £1 of pension pa"]
[20,9.09]
[21,9.23]
[22,9.36]
[23,9.49]
[24,9.6300000000000008]
[25,9.77]
[26,9.91]
[27,10.050000000000001]
[28,10.199999999999999]
[29,10.35]
[30,10.5]
[31,10.65]
[32,10.8]
[33,10.96]
[34,11.12]
[35,11.28]
[36,11.44]
[37,11.61]
[38,11.78]
[39,11.95]
[40,12.12]
[41,12.3]
[42,12.48]
[43,12.66]
[44,12.85]
[45,13.04]
[46,13.23]
[47,13.43]
[48,13.63]
[49,13.83]
[50,14.04]
[51,14.25]
[52,14.47]
[53,14.69]
[54,14.92]
[55,15.15]
[56,15.38]
[57,15.63]
[58,15.88]
[59,16.14]
[60,16.41]
[61,16.68]
[62,16.97]
[63,17.27]
[64,17.579999999999998]
[65,17.899999999999999]
[66,18.239999999999998]
[67,18.079999999999998]
[68,17.41]
[69,16.739999999999998]
[70,16.059999999999999]
[71,15.4]
[72,14.74]
[73,14.08]
[74,13.42]

{"sheet":"x-608","index":92,"n_rows":80,"n_cols":2,"rows_kept":80,"cut":false,"hidden":false,"merged":[]}
["Government Actuary's Department"]
[{"$f":"IF(title=\"> Enter workbook title here\",\"Enter workbook title in Cover sheet\",title)","v":"TPS (England & Wales) - Consolidated Factor Spreadsheet"}]
[{"$f":"TABLE_FACTOR_TYPE&\" - x-\"&TABLE_SERIES_NUMBER","v":"Scheme pays AA - x-608"}]
[]
[]
["Data Item","Factor Table Information"]
["Client","TPS_EW"]
["Section","Career Average"]
["Factor Type","Scheme pays AA"]
["Description","Factors for calculating annual allowance debit - NPA 68"]
["Gender","Unisex"]
["Factor Age/Period Definition","Age last birthday at relevant date"]
["Section Number",0]
["Series Number",608]
["Table Reference","x-608"]
["Table Reference in Guidance","Table CSP68a"]
["Associated Guidance Note","Teachers' Pension Scheme: Career average section\nAnnual allowance tax charge debits: Factors and guidance\nDate: 11 September 2019"]
["Date Factors Issued to Client","2023-07-28"]
["Date Factors Implemented (if known)"]
["Factor Status","Issued"]
[]
[null,{"$f":"HYPERLINK(\"#'Factor List'!A1\",\"Back to Factor List\")","v":"Back to Factor List"}]
[]
[]
["Age","Annual allowance debit factor per £1 of pension pa"]
[20,8.66]
[21,8.7799999999999994]
[22,8.91]
[23,9.0399999999999991]
[24,9.17]
[25,9.3000000000000007]
[26,9.43]
[27,9.57]
[28,9.6999999999999993]
[29,9.84]
[30,9.98]
[31,10.130000000000001]
[32,10.27]
[33,10.42]
[34,10.57]
[35,10.72]
[36,10.88]
[37,11.03]
[38,11.19]
[39,11.35]
[40,11.52]
[41,11.68]
[42,11.85]
[43,12.03]
[44,12.2]
[45,12.38]
[46,12.56]
[47,12.74]
[48,12.93]
[49,13.12]
[50,13.32]
[51,13.52]
[52,13.72]
[53,13.93]
[54,14.14]
[55,14.36]
[56,14.58]
[57,14.81]
[58,15.05]
[59,15.29]
[60,15.54]
[61,15.8]
[62,16.07]
[63,16.350000000000001]
[64,16.64]
[65,16.95]
[66,17.27]
[67,17.600000000000001]
[68,17.43]
[69,16.760000000000002]
[70,16.079999999999998]
[71,15.41]
[72,14.74]
[73,14.08]
[74,13.42]

{"sheet":"x-609","index":93,"n_rows":65,"n_cols":13,"rows_kept":65,"cut":false,"hidden":false,"merged":[]}
["Government Actuary's Department"]
[{"$f":"IF(title=\"> Enter workbook title here\",\"Enter workbook title in Cover sheet\",title)","v":"TPS (England & Wales) - Consolidated Factor Spreadsheet"}]
[{"$f":"TABLE_FACTOR_TYPE&\" - x-\"&TABLE_SERIES_NUMBER","v":"Scheme pays AA - x-609"}]
[]
[]
["Data Item","Factor Table Information"]
["Client","TPS_EW"]
["Section","Career Average"]
["Factor Type","Scheme pays AA"]
["Description","Timing adjustments on ill health retirements - All NPAs"]
["Gender","Unisex"]
["Factor Age/Period Definition","Period to NPA (years/months) - part months rounded up to the nearest month"]
["Section Number",0]
["Series Number",609]
["Table Reference","x-609"]
["Table Reference in Guidance","Table TA1a"]
["Associated Guidance Note","Teachers' Pension Scheme: Career average section\nAnnual allowance tax charge debits: Factors and guidance\nDate: 11 September 2019"]
["Date Factors Issued to Client","2023-07-28"]
["Date Factors Implemented (if known)"]
["Factor Status","Issued"]
[]
[null,{"$f":"HYPERLINK(\"#'Factor List'!A1\",\"Back to Factor List\")","v":"Back to Factor List"}]
[]
[]
["Years/Months Early",0,1,2,3,4,5,6,7,8,9,10,11]
[0,1,0.998,0.99299999999999999,0.98899999999999999,0.98399999999999999,0.97899999999999998,0.97499999999999998,0.97,0.96599999999999997,0.96099999999999997,0.95599999999999996,0.95199999999999996]
[1,0.94699999999999995,0.94299999999999995,0.93899999999999995,0.93400000000000005,0.93,0.92600000000000005,0.92200000000000004,0.91700000000000004,0.91300000000000003,0.90900000000000003,0.90500000000000003,0.9]
[2,0.89600000000000002,0.89200000000000002,0.88800000000000001,0.88400000000000001,0.88,0.876,0.872,0.86799999999999999,0.86399999999999999,0.86,0.85599999999999998,0.85199999999999998]
[3,0.84799999999999998,0.84399999999999997,0.84099999999999997,0.83699999999999997,0.83299999999999996,0.83,0.82599999999999996,0.82199999999999995,0.81899999999999995,0.81499999999999995,0.81100000000000005,0.80800000000000005]
[4,0.80400000000000005,0.8,0.79700000000000004,0.79400000000000004,0.79,0.78700000000000003,0.78400000000000003,0.78,0.77700000000000002,0.77400000000000002,0.77,0.76700000000000002]
[5,0.76400000000000001,0.76,0.75700000000000001,0.754,0.751,0.748,0.745,0.74199999999999999,0.73899999999999999,0.73599999999999999,0.73299999999999998,0.73]
[6,0.72699999999999998,0.72399999999999998,0.72099999999999997,0.71799999999999997,0.71499999999999997,0.71199999999999997,0.70899999999999996,0.70699999999999996,0.70399999999999996,0.70099999999999996,0.69799999999999995,0.69499999999999995]
[7,0.69199999999999995,0.69,0.68700000000000006,0.68500000000000005,0.68200000000000005,0.67900000000000005,0.67700000000000005,0.67400000000000004,0.67200000000000004,0.66900000000000004,0.66600000000000004,0.66400000000000003]
[8,0.66100000000000003,0.65900000000000003,0.65600000000000003,0.65400000000000003,0.65200000000000002,0.64900000000000002,0.64700000000000002,0.64400000000000002,0.64200000000000002,0.63900000000000001,0.63700000000000001,0.63500000000000001]
[9,0.63200000000000001,0.63,0.628,0.625,0.623,0.621,0.61799999999999999,0.61599999999999999,0.61399999999999999,0.61099999999999999,0.60899999999999999,0.60699999999999998]
[10,0.60399999999999998,0.60199999999999998,0.6,0.59799999999999998,0.59599999999999997,0.59399999999999997,0.59199999999999997,0.58899999999999997,0.58699999999999997,0.58499999999999996,0.58299999999999996,0.58099999999999996]
[11,0.57899999999999996,0.57699999999999996,0.57499999999999996,0.57299999999999995,0.57099999999999995,0.56899999999999995,0.56699999999999995,0.56499999999999995,0.56299999999999994,0.56100000000000005,0.55900000000000005,0.55700000000000005]
[12,0.55500000000000005,0.55300000000000005,0.55100000000000005,0.54900000000000004,0.54800000000000004,0.54600000000000004,0.54400000000000004,0.54200000000000004,0.54,0.53800000000000003,0.53700000000000003,0.53500000000000003]
[13,0.53300000000000003,0.53100000000000003,0.52900000000000003,0.52800000000000002,0.52600000000000002,0.52400000000000002,0.52200000000000002,0.52100000000000002,0.51900000000000002,0.51700000000000002,0.51500000000000001,0.51400000000000001]
[14,0.51200000000000001,0.51,0.50900000000000001,0.50700000000000001,0.505,0.504,0.502,0.5,0.499,0.497,0.495,0.49399999999999999]
[15,0.49199999999999999,0.49,0.48899999999999999,0.48699999999999999,0.48499999999999999,0.48399999999999999,0.48199999999999998,0.48099999999999998,0.47899999999999998,0.47799999999999998,0.47599999999999998,0.47399999999999998]
[16,0.47299999999999998,0.47099999999999997,0.47,0.46800000000000003,0.46700000000000003,0.46600000000000003,0.46400000000000002,0.46300000000000002,0.46100000000000002,0.46,0.45900000000000002,0.45700000000000002]
[17,0.45600000000000002,0.45400000000000001,0.45300000000000001,0.45100000000000001,0.45,0.44900000000000001,0.44700000000000001,0.44600000000000001,0.44400000000000001,0.443,0.442,0.44]
[18,0.439,0.437,0.436,0.434,0.433,0.43099999999999999,0.43,0.42799999999999999,0.42699999999999999,0.42499999999999999,0.42399999999999999,0.42199999999999999]
[19,0.42099999999999999,0.41899999999999998,0.41799999999999998,0.41599999999999998,0.41499999999999998,0.41399999999999998,0.41199999999999998,0.41099999999999998,0.40899999999999997,0.40799999999999997,0.40699999999999997,0.40500000000000003]
[20,0.40400000000000003,0.40200000000000002,0.40100000000000002,0.4,0.39800000000000002,0.39700000000000002,0.39600000000000002,0.39400000000000002,0.39300000000000002,0.39200000000000002,0.39,0.38900000000000001]
[21,0.38800000000000001,0.38600000000000001,0.38500000000000001,0.38400000000000001,0.38300000000000001,0.38100000000000001,0.38,0.379,0.378,0.376,0.375,0.374]
[22,0.373,0.371,0.37,0.36899999999999999,0.36799999999999999,0.36699999999999999,0.36599999999999999,0.36499999999999999,0.36399999999999999,0.36299999999999999,0.36199999999999999,0.36099999999999999]
[23,0.36,0.35899999999999999,0.35799999999999998,0.35699999999999998,0.35599999999999998,0.35499999999999998,0.35399999999999998,0.35299999999999998,0.35199999999999998,0.35099999999999998,0.35,0.34899999999999998]
[24,0.34799999999999998,0.34699999999999998,0.34599999999999997,0.34499999999999997,0.34399999999999997,0.34300000000000003,0.34200000000000003,0.34100000000000003,0.34,0.33900000000000002,0.33800000000000002,0.33700000000000002]
[25,0.33600000000000002,0.33600000000000002,0.33500000000000002,0.33400000000000002,0.33300000000000002,0.33200000000000002,0.33100000000000002,0.33,0.32900000000000001,0.32800000000000001,0.32700000000000001,0.32600000000000001]
[26,0.32500000000000001,0.32500000000000001,0.32400000000000001,0.32300000000000001,0.32200000000000001,0.32100000000000001,0.32,0.31900000000000001,0.318,0.317,0.316,0.315]
[27,0.314,0.314,0.313,0.312,0.311,0.311,0.31,0.309,0.308,0.308,0.307,0.30599999999999999]
[28,0.30499999999999999,0.30499999999999999,0.30399999999999999,0.30299999999999999,0.30199999999999999,0.30099999999999999,0.3,0.3,0.29899999999999999,0.29799999999999999,0.29699999999999999,0.29599999999999999]
[29,0.29499999999999998,0.29499999999999998,0.29399999999999998,0.29299999999999998,0.29199999999999998,0.29199999999999998,0.29099999999999998,0.28999999999999998,0.28899999999999998,0.28899999999999998,0.28799999999999998,0.28699999999999998]
[30,0.28599999999999998,0.28599999999999998,0.28499999999999998,0.28399999999999997,0.28299999999999997,0.28299999999999997,0.28199999999999997,0.28100000000000003,0.28000000000000003,0.28000000000000003,0.27900000000000003,0.27800000000000002]
[31,0.27700000000000002,0.27700000000000002,0.27600000000000002,0.27500000000000002,0.27500000000000002,0.27400000000000002,0.27300000000000002,0.27300000000000002,0.27200000000000002,0.27100000000000002,0.27100000000000002,0.27]
[32,0.26900000000000002,0.26900000000000002,0.26800000000000002,0.26700000000000002,0.26700000000000002,0.26600000000000001,0.26500000000000001,0.26500000000000001,0.26400000000000001,0.26300000000000001,0.26300000000000001,0.26200000000000001]
[33,0.26100000000000001,0.26100000000000001,0.26,0.25900000000000001,0.25900000000000001,0.25800000000000001,0.25700000000000001,0.25700000000000001,0.25600000000000001,0.255,0.255,0.254]
[34,0.253,0.253,0.252,0.252,0.251,0.25,0.25,0.249,0.249,0.248,0.247,0.247]
[35,0.246,0.246,0.245,0.245,0.24399999999999999,0.24299999999999999,0.24299999999999999,0.24199999999999999,0.24199999999999999,0.24099999999999999,0.24,0.24]
[36,0.23899999999999999,0.23899999999999999,0.23799999999999999,0.23799999999999999,0.23699999999999999,0.23599999999999999,0.23599999999999999,0.23499999999999999,0.23499999999999999,0.23400000000000001,0.23300000000000001,0.23300000000000001]
[37,0.23200000000000001,0.23200000000000001,0.23100000000000001,0.23100000000000001,0.23,0.23,0.22900000000000001,0.22900000000000001,0.22800000000000001,0.22800000000000001,0.22700000000000001,0.22700000000000001]
[38,0.22600000000000001,0.22600000000000001,0.22500000000000001,0.22500000000000001,0.224,0.223,0.223,0.222,0.222,0.221,0.22,0.22]
[39,0.219,0.219,0.218,0.218,0.217,0.217,0.216,0.216,0.215,0.215,0.214,0.214]

{"sheet":"x-610","index":94,"n_rows":45,"n_cols":2,"rows_kept":45,"cut":false,"hidden":false,"merged":[]}
["Government Actuary's Department"]
[{"$f":"IF(title=\"> Enter workbook title here\",\"Enter workbook title in Cover sheet\",title)","v":"TPS (England & Wales) - Consolidated Factor Spreadsheet"}]
[{"$f":"TABLE_FACTOR_TYPE&\" - x-\"&TABLE_SERIES_NUMBER","v":"Scheme pays LTA - x-610"}]
[]
[]
["Data Item","Factor Table Information"]
["Client","TPS_EW"]
["Section","All"]
["Factor Type","Scheme pays LTA"]
["Description","Factors to calculate debit to pension for LTA tax charges for retirements not on grounds of ill health"]
["Gender","Unisex"]
["Factor Age/Period Definition","Age last birthday at relevant date"]
["Section Number",0]
["Series Number",610]
["Table Reference","x-610"]
["Table Reference in Guidance","Table LTA_NH1"]
["Associated Guidance Note","Teachers' Pension Scheme: Final salary and career average sections\nLifetime Allowance tax charge debits: Factors and guidance\nDate: 11 September 2019"]
["Date Factors Issued to Client","2023-07-28"]
["Date Factors Implemented (if known)"]
["Factor Status","Issued"]
[]
[null,{"$f":"HYPERLINK(\"#'Factor List'!A1\",\"Back to Factor List\")","v":"Back to Factor List"}]
[]
[]
["Age","LTA debit factor per £1 pension pa"]
[55,25.44]
[56,24.86]
[57,24.27]
[58,23.68]
[59,23.08]
[60,22.48]
[61,21.86]
[62,21.25]
[63,20.63]
[64,20]
[65,19.37]
[66,18.73]
[67,18.09]
[68,17.45]
[69,16.8]
[70,16.16]
[71,15.51]
[72,14.87]
[73,14.23]
[74,13.59]

{"sheet":"x-611","index":95,"n_rows":73,"n_cols":2,"rows_kept":73,"cut":false,"hidden":false,"merged":[]}
["Government Actuary's Department"]
[{"$f":"IF(title=\"> Enter workbook title here\",\"Enter workbook title in Cover sheet\",title)","v":"TPS (England & Wales) - Consolidated Factor Spreadsheet"}]
[{"$f":"TABLE_FACTOR_TYPE&\" - x-\"&TABLE_SERIES_NUMBER","v":"Scheme pays LTA - x-611"}]
[]
[]
["Data Item","Factor Table Information"]
["Client","TPS_EW"]
["Section","All"]
["Factor Type","Scheme pays LTA"]
["Description","Factors to calculate debit to pension for LTA tax charges for retirements on grounds of ill health"]
["Gender","Unisex"]
["Factor Age/Period Definition","Age last birthday at relevant date"]
["Section Number",0]
["Series Number",611]
["Table Reference","x-611"]
["Table Reference in Guidance","Table LTA_IH1"]
["Associated Guidance Note","Teachers' Pension Scheme: Final salary and career average sections\nLifetime Allowance tax charge debits: Factors and guidance\nDate: 11 September 2019"]
["Date Factors Issued to Client","2023-07-28"]
["Date Factors Implemented (if known)"]
["Factor Status","Issued"]
[]
[null,{"$f":"HYPERLINK(\"#'Factor List'!A1\",\"Back to Factor List\")","v":"Back to Factor List"}]
[]
[]
["Age","LTA debit factor per £1 pension pa"]
[20,33.590000000000003]
[21,33.35]
[22,33.1]
[23,32.86]
[24,32.61]
[25,32.36]
[26,32.1]
[27,31.85]
[28,31.6]
[29,31.35]
[30,31.1]
[31,30.85]
[32,30.6]
[33,30.34]
[34,30.09]
[35,29.83]
[36,29.56]
[37,29.3]
[38,29.02]
[39,28.74]
[40,28.44]
[41,28.14]
[42,27.84]
[43,27.52]
[44,27.19]
[45,26.86]
[46,26.52]
[47,26.17]
[48,25.81]
[49,25.43]
[50,25.05]
[51,24.65]
[52,24.24]
[53,23.81]
[54,23.37]
[55,22.92]
[56,22.46]
[57,21.98]
[58,21.5]
[59,21]
[60,20.46]
[61,19.899999999999999]
[62,19.34]
[63,18.77]
[64,18.2]
[65,17.62]
[66,17.04]
[67,16.440000000000001]

{"sheet":"x-702","index":96,"n_rows":70,"n_cols":3,"rows_kept":70,"cut":false,"hidden":false,"merged":[]}
["Government Actuary's Department"]
[{"$f":"IF(title=\"> Enter workbook title here\",\"Enter workbook title in Cover sheet\",title)","v":"TPS (England & Wales) - Consolidated Factor Spreadsheet"}]
[{"$f":"TABLE_FACTOR_TYPE&\" - x-\"&TABLE_SERIES_NUMBER","v":"Added pension - x-702"}]
[]
[]
["Data Item","Factor Table Information"]
["Client","TPS_EW"]
["Section","All"]
["Factor Type","Added pension"]
["Description","Lump sum elections - Single premium per £250 AP at date of election, £. - NPA 65 (New Election)"]
["Gender","Unisex"]
["Factor Age/Period Definition","Age when notice of election given"]
["Section Number",0]
["Series Number",702]
["Table Reference","x-702"]
["Table Reference in Guidance","Table S65"]
["Associated Guidance Note","Teachers' Pension Scheme: Final salary sections and career average section\nPurchase of additional pension and ceasing monthly contribution elections: Factors and guidance\nDate: 24 June 2019"]
["Date Factors Issued to Client","2023-10-17"]
["Date Factors Implemented (if known)"]
["Factor Status","Issued"]
[]
[null,{"$f":"HYPERLINK(\"#'Factor List'!A1\",\"Back to Factor List\")","v":"Back to Factor List"}]
[]
[]
["Age","Personal","Personal and dependant’s"]
[20,2560,2770]
[21,2600,2810]
[22,2640,2850]
[23,2670,2900]
[24,2710,2940]
[25,2750,2980]
[26,2800,3030]
[27,2840,3070]
[28,2880,3120]
[29,2920,3160]
[30,2960,3210]
[31,3010,3260]
[32,3050,3300]
[33,3100,3350]
[34,3140,3400]
[35,3190,3450]
[36,3240,3500]
[37,3280,3550]
[38,3330,3610]
[39,3380,3660]
[40,3430,3710]
[41,3480,3760]
[42,3530,3820]
[43,3580,3870]
[44,3630,3930]
[45,3690,3980]
[46,3740,4040]
[47,3790,4100]
[48,3850,4160]
[49,3900,4210]
[50,3960,4270]
[51,4020,4330]
[52,4070,4390]
[53,4130,4450]
[54,4190,4510]
[55,4250,4580]
[56,4310,4640]
[57,4380,4700]
[58,4440,4770]
[59,4510,4840]
[60,4580,4910]
[61,4650,4980]
[62,4720,5060]
[63,4800,5140]
[64,4880,5220]

{"sheet":"x-703","index":97,"n_rows":71,"n_cols":3,"rows_kept":71,"cut":false,"hidden":false,"merged":[]}
["Government Actuary's Department"]
[{"$f":"IF(title=\"> Enter workbook title here\",\"Enter workbook title in Cover sheet\",title)","v":"TPS (England & Wales) - Consolidated Factor Spreadsheet"}]
[{"$f":"TABLE_FACTOR_TYPE&\" - x-\"&TABLE_SERIES_NUMBER","v":"Added pension - x-703"}]
[]
[]
["Data Item","Factor Table Information"]
["Client","TPS_EW"]
["Section","Career Average"]
["Factor Type","Added pension"]
["Description","Lump sum elections - Single premium per £250 AP at date of election, £. - NPA 66 (New Election)"]
["Gender","Unisex"]
["Factor Age/Period Definition","Age when notice of election given"]
["Section Number",0]
["Series Number",703]
["Table Reference","x-703"]
["Table Reference in Guidance","Table S66"]
["Associated Guidance Note","Teachers' Pension Scheme: Final salary sections and career average section\nPurchase of additional pension and ceasing monthly contribution elections: Factors and guidance\nDate: 24 June 2019"]
["Date Factors Issued to Client","2023-10-17"]
["Date Factors Implemented (if known)"]
["Factor Status","Issued"]
[]
[null,{"$f":"HYPERLINK(\"#'Factor List'!A1\",\"Back to Factor List\")","v":"Back to Factor List"}]
[]
[]
["Age","Personal","Personal and dependant’s"]
[20,2450,2660]
[21,2490,2700]
[22,2520,2740]
[23,2560,2780]
[24,2600,2830]
[25,2640,2870]
[26,2680,2910]
[27,2720,2950]
[28,2760,3000]
[29,2800,3040]
[30,2840,3090]
[31,2880,3130]
[32,2920,3180]
[33,2970,3220]
[34,3010,3270]
[35,3050,3320]
[36,3100,3360]
[37,3140,3410]
[38,3190,3460]
[39,3230,3510]
[40,3280,3560]
[41,3330,3610]
[42,3380,3670]
[43,3430,3720]
[44,3480,3770]
[45,3530,3820]
[46,3580,3880]
[47,3630,3930]
[48,3680,3990]
[49,3730,4040]
[50,3780,4100]
[51,3840,4150]
[52,3890,4210]
[53,3950,4270]
[54,4000,4320]
[55,4060,4380]
[56,4110,4440]
[57,4170,4500]
[58,4230,4570]
[59,4300,4630]
[60,4360,4700]
[61,4430,4760]
[62,4500,4830]
[63,4570,4910]
[64,4640,4980]
[65,4720,5060]

{"sheet":"x-704","index":98,"n_rows":72,"n_cols":3,"rows_kept":72,"cut":false,"hidden":false,"merged":[]}
["Government Actuary's Department"]
[{"$f":"IF(title=\"> Enter workbook title here\",\"Enter workbook title in Cover sheet\",title)","v":"TPS (England & Wales) - Consolidated Factor Spreadsheet"}]
[{"$f":"TABLE_FACTOR_TYPE&\" - x-\"&TABLE_SERIES_NUMBER","v":"Added pension - x-704"}]
[]
[]
["Data Item","Factor Table Information"]
["Client","TPS_EW"]
["Section","Career Average"]
["Factor Type","Added pension"]
["Description","Lump sum elections - Single premium per £250 AP at date of election, £. - NPA 67 (New Election)"]
["Gender","Unisex"]
["Factor Age/Period Definition","Age when notice of election given"]
["Section Number",0]
["Series Number",704]
["Table Reference","x-704"]
["Table Reference in Guidance","Table S67"]
["Associated Guidance Note","Teachers' Pension Scheme: Final salary sections and career average section\nPurchase of additional pension and ceasing monthly contribution elections: Factors and guidance\nDate: 24 June 2019"]
["Date Factors Issued to Client","2023-10-17"]
["Date Factors Implemented (if known)"]
["Factor Status","Issued"]
[]
[null,{"$f":"HYPERLINK(\"#'Factor List'!A1\",\"Back to Factor List\")","v":"Back to Factor List"}]
[]
[]
["Age","Personal","Personal and dependant’s"]
[20,2350,2560]
[21,2380,2600]
[22,2420,2640]
[23,2450,2680]
[24,2490,2720]
[25,2530,2760]
[26,2560,2800]
[27,2600,2840]
[28,2640,2880]
[29,2680,2920]
[30,2720,2960]
[31,2760,3010]
[32,2800,3050]
[33,2840,3090]
[34,2880,3140]
[35,2920,3180]
[36,2960,3230]
[37,3010,3280]
[38,3050,3320]
[39,3090,3370]
[40,3140,3420]
[41,3180,3470]
[42,3230,3520]
[43,3280,3570]
[44,3320,3620]
[45,3370,3670]
[46,3420,3720]
[47,3470,3770]
[48,3510,3820]
[49,3560,3870]
[50,3610,3930]
[51,3660,3980]
[52,3710,4030]
[53,3760,4090]
[54,3820,4140]
[55,3870,4190]
[56,3920,4250]
[57,3980,4310]
[58,4030,4370]
[59,4090,4430]
[60,4150,4490]
[61,4220,4550]
[62,4280,4620]
[63,4350,4680]
[64,4420,4750]
[65,4490,4830]
[66,4560,4900]

{"sheet":"x-705","index":99,"n_rows":73,"n_cols":3,"rows_kept":73,"cut":false,"hidden":false,"merged":[]}
["Government Actuary's Department"]
[{"$f":"IF(title=\"> Enter workbook title here\",\"Enter workbook title in Cover sheet\",title)","v":"TPS (England & Wales) - Consolidated Factor Spreadsheet"}]
[{"$f":"TABLE_FACTOR_TYPE&\" - x-\"&TABLE_SERIES_NUMBER","v":"Added pension - x-705"}]
[]
[]
["Data Item","Factor Table Information"]
["Client","TPS_EW"]
["Section","Career Average"]
["Factor Type","Added pension"]
["Description","Lump sum elections - Single premium per £250 AP at date of election, £. - NPA 68 (New Election)"]
["Gender","Unisex"]
["Factor Age/Period Definition","Age when notice of election given"]
["Section Number",0]
["Series Number",705]
["Table Reference","x-705"]
["Table Reference in Guidance","Table S68"]
["Associated Guidance Note","Teachers' Pension Scheme: Final salary sections and career average section\nPurchase of additional pension and ceasing monthly contribution elections: Factors and guidance\nDate: 24 June 2019"]
["Date Factors Issued to Client","2023-10-17"]
["Date Factors Implemented (if known)"]
["Factor Status","Issued"]
[]
[null,{"$f":"HYPERLINK(\"#'Factor List'!A1\",\"Back to Factor List\")","v":"Back to Factor List"}]
[]
[]
["Age","Personal","Personal and dependant’s"]
[20,2250,2460]
[21,2280,2500]
[22,2310,2530]
[23,2350,2570]
[24,2380,2610]
[25,2420,2650]
[26,2450,2690]
[27,2490,2720]
[28,2520,2760]
[29,2560,2800]
[30,2600,2850]
[31,2640,2890]
[32,2670,2930]
[33,2710,2970]
[34,2750,3010]
[35,2790,3060]
[36,2830,3100]
[37,2870,3140]
[38,2910,3190]
[39,2960,3230]
[40,3000,3280]
[41,3040,3330]
[42,3080,3370]
[43,3130,3420]
[44,3170,3470]
[45,3220,3520]
[46,3260,3560]
[47,3310,3610]
[48,3350,3660]
[49,3400,3710]
[50,3450,3760]
[51,3490,3810]
[52,3540,3860]
[53,3590,3910]
[54,3640,3960]
[55,3690,4010]
[56,3740,4060]
[57,3790,4120]
[58,3840,4170]
[59,3890,4230]
[60,3950,4280]
[61,4010,4340]
[62,4070,4400]
[63,4130,4470]
[64,4190,4530]
[65,4260,4600]
[66,4330,4670]
[67,4410,4740]

{"sheet":"x-706","index":100,"n_rows":64,"n_cols":21,"rows_kept":64,"cut":false,"hidden":false,"merged":[]}
["Government Actuary's Department"]
[{"$f":"IF(title=\"> Enter workbook title here\",\"Enter workbook title in Cover sheet\",title)","v":"TPS (England & Wales) - Consolidated Factor Spreadsheet"}]
[{"$f":"TABLE_FACTOR_TYPE&\" - x-\"&TABLE_SERIES_NUMBER","v":"Added pension - x-706"}]
[]
[]
["Data Item","Factor Table Information"]
["Client","TPS_EW"]
["Section","Final Salary"]
["Factor Type","Added pension"]
["Description","Personal benefits, NPA 60. (Regular contribution elections made after 22 June 2010). Monthly contribution per £250 AP at date of election, £"]
["Gender","Unisex"]
["Factor Age/Period Definition","Age when notice of election given/ Payment period (in years)"]
["Section Number",1]
["Series Number",706]
["Table Reference","x-706"]
["Table Reference in Guidance","Table C60"]
["Associated Guidance Note","Teachers' Pension Scheme: Final salary sections and career average section\nPurchase of additional pension and ceasing monthly contribution elections: Factors and guidance\nDate: 24 June 2019"]
["Date Factors Issued to Client","2023-10-17"]
["Date Factors Implemented (if known)"]
["Factor Status","Issued"]
[]
[null,{"$f":"HYPERLINK(\"#'Factor List'!A1\",\"Back to Factor List\")","v":"Back to Factor List"}]
[]
[]
["Age",1,2,3,4,5,6,7,8,9,10,11,12,13,14,15,16,17,18,19,20]
[20,262,133.4,90.6,69.2,56.3,47.8,41.7,37.1,33.6,30.7,28.4,26.5,24.9,23.5,22.3,21.3,20.399999999999999,19.5,18.8,18.2]
[21,265.89999999999998,135.4,91.9,70.2,57.2,48.5,42.3,37.700000000000003,34.1,31.2,28.9,26.9,25.3,23.9,22.7,21.6,20.7,19.8,19.100000000000001,18.5]
[22,270,137.5,93.3,71.3,58,49.2,42.9,38.200000000000003,34.6,31.7,29.3,27.3,25.7,24.2,23,21.9,21,20.100000000000001,19.399999999999999,18.7]
[23,274,139.5,94.7,72.3,58.9,50,43.6,38.799999999999997,35.1,32.200000000000003,29.7,27.7,26,24.6,23.3,22.3,21.3,20.5,19.7,19]
[24,278.2,141.6,96.2,73.400000000000006,59.8,50.7,44.3,39.4,35.700000000000003,32.6,30.2,28.2,26.4,25,23.7,22.6,21.6,20.8,20,19.3]
[25,282.39999999999998,143.80000000000001,97.6,74.5,60.7,51.5,44.9,40,36.200000000000003,33.1,30.7,28.6,26.8,25.4,24.1,22.9,22,21.1,20.3,19.600000000000001]
[26,286.60000000000002,146,99.1,75.7,61.6,52.3,45.6,40.6,36.700000000000003,33.6,31.1,29,27.3,25.7,24.4,23.3,22.3,21.4,20.6,19.899999999999999]
[27,291,148.19999999999999,100.6,76.8,62.6,53.1,46.3,41.2,37.299999999999997,34.200000000000003,31.6,29.5,27.7,26.1,24.8,23.6,22.6,21.7,20.9,20.2]
[28,295.3,150.4,102.1,78,63.5,53.9,47,41.9,37.9,34.700000000000003,32.1,29.9,28.1,26.5,25.2,24,23,22.1,21.3,20.5]
[29,299.8,152.6,103.6,79.099999999999994,64.5,54.7,47.7,42.5,38.4,35.200000000000003,32.6,30.4,28.5,26.9,25.6,24.4,23.3,22.4,21.6,20.8]
[30,304.3,154.9,105.2,80.3,65.400000000000006,55.5,48.4,43.1,39,35.700000000000003,33.1,30.8,28.9,27.3,26,24.7,23.7,22.7,21.9,21.2]
[31,308.8,157.30000000000001,106.8,81.5,66.400000000000006,56.3,49.2,43.8,39.6,36.299999999999997,33.6,31.3,29.4,27.8,26.4,25.1,24.1,23.1,22.3,21.5]
[32,313.5,159.6,108.4,82.8,67.400000000000006,57.2,49.9,44.4,40.200000000000003,36.799999999999997,34.1,31.8,29.8,28.2,26.8,25.5,24.4,23.5,22.6,21.8]
[33,318.2,162,110,84,68.400000000000006,58.1,50.7,45.1,40.799999999999997,37.4,34.6,32.299999999999997,30.3,28.6,27.2,25.9,24.8,23.8,23,22.2]
[34,323,164.5,111.7,85.3,69.5,58.9,51.4,45.8,41.4,38,35.1,32.799999999999997,30.8,29.1,27.6,26.3,25.2,24.2,23.3,22.5]
[35,327.8,166.9,113.3,86.6,70.5,59.8,52.2,46.5,42.1,38.5,35.6,33.299999999999997,31.2,29.5,28,26.7,25.6,24.6,23.7,22.9]
[36,332.7,169.5,115.1,87.9,71.599999999999994,60.7,53,47.2,42.7,39.1,36.200000000000003,33.799999999999997,31.7,30,28.5,27.1,26,25,24.1,23.2]
[37,337.7,172,116.8,89.2,72.7,61.7,53.8,47.9,43.4,39.700000000000003,36.799999999999997,34.299999999999997,32.200000000000003,30.4,28.9,27.6,26.4,25.4,24.4,23.6]
[38,342.8,174.6,118.5,90.5,73.8,62.6,54.6,48.7,44,40.299999999999997,37.299999999999997,34.799999999999997,32.700000000000003,30.9,29.4,28,26.8,25.8,24.8,24]
[39,348,177.2,120.3,91.9,74.900000000000006,63.5,55.5,49.4,44.7,41,37.9,35.4,33.200000000000003,31.4,29.8,28.5,27.3,26.2,25.2,24.4]
[40,353.2,179.9,122.2,93.3,76,64.5,56.3,50.2,45.4,41.6,38.5,35.9,33.799999999999997,31.9,30.3,28.9,27.7,26.6,25.7]
[41,358.5,182.6,124,94.7,77.2,65.5,57.2,50.9,46.1,42.2,39.1,36.5,34.299999999999997,32.4,30.8,29.4,28.2,27.1]
[42,363.9,185.4,125.9,96.2,78.400000000000006,66.5,58.1,51.7,46.8,42.9,39.700000000000003,37.1,34.799999999999997,32.9,31.3,29.9,28.6]
[43,369.4,188.2,127.8,97.6,79.599999999999994,67.5,59,52.5,47.6,43.6,40.4,37.700000000000003,35.4,33.5,31.8,30.4]
[44,375,191,129.69999999999999,99.1,80.8,68.599999999999994,59.9,53.4,48.3,44.3,41,38.299999999999997,36,34,32.4]
[45,380.6,193.9,131.69999999999999,100.7,82,69.7,60.8,54.2,49.1,45,41.7,38.9,36.6,34.6]
[46,386.4,196.9,133.69999999999999,102.2,83.3,70.8,61.8,55.1,49.9,45.7,42.4,39.6,37.200000000000003]
[47,392.2,199.9,135.80000000000001,103.8,84.6,71.900000000000006,62.8,56,50.7,46.5,43.1,40.200000000000003]
[48,398.1,202.9,137.9,105.4,86,73,63.8,56.9,51.5,47.3,43.8]
[49,404.2,206,140,107.1,87.3,74.2,64.8,57.8,52.4,48.1]
[50,410.4,209.2,142.19999999999999,108.8,88.7,75.400000000000006,65.900000000000006,58.8,53.3]
[51,416.6,212.4,144.4,110.5,90.1,76.599999999999994,67,59.7]
[52,423,215.7,146.69999999999999,112.2,91.6,77.8,68.099999999999994]
[53,429.6,219.1,149,114,93.1,79.099999999999994]
[54,436.3,222.6,151.4,115.9,94.6]
[55,443.1,226.1,153.80000000000001,117.7]
[56,450.1,229.7,156.30000000000001]
[57,457.4,233.5]
[58,465]

{"sheet":"x-707","index":101,"n_rows":64,"n_cols":21,"rows_kept":64,"cut":false,"hidden":false,"merged":[]}
["Government Actuary's Department"]
[{"$f":"IF(title=\"> Enter workbook title here\",\"Enter workbook title in Cover sheet\",title)","v":"TPS (England & Wales) - Consolidated Factor Spreadsheet"}]
[{"$f":"TABLE_FACTOR_TYPE&\" - x-\"&TABLE_SERIES_NUMBER","v":"Added pension - x-707"}]
[]
[]
["Data Item","Factor Table Information"]
["Client","TPS_EW"]
["Section","Final Salary"]
["Factor Type","Added pension"]
["Description","Personal and dependant's benefits, NPA 60. (Regular contribution elections made after 22 June 2010). Monthly contribution per £250 AP at date of election, £"]
["Gender","Unisex"]
["Factor Age/Period Definition","Age when notice of election given/ Payment period (in years)"]
["Section Number",1]
["Series Number",707]
["Table Reference","x-707"]
["Table Reference in Guidance","Table C60D"]
["Associated Guidance Note","Teachers' Pension Scheme: Final salary sections and career average section\nPurchase of additional pension and ceasing monthly contribution elections: Factors and guidance\nDate: 24 June 2019"]
["Date Factors Issued to Client","2023-10-17"]
["Date Factors Implemented (if known)"]
["Factor Status","Issued"]
[]
[null,{"$f":"HYPERLINK(\"#'Factor List'!A1\",\"Back to Factor List\")","v":"Back to Factor List"}]
[]
[]
["Age",1,2,3,4,5,6,7,8,9,10,11,12,13,14,15,16,17,18,19,20]
[20,279.7,142.4,96.7,73.8,60.1,51,44.5,39.6,35.799999999999997,32.799999999999997,30.4,28.3,26.6,25.1,23.8,22.7,21.7,20.9,20.100000000000001,19.399999999999999]
[21,283.89999999999998,144.6,98.1,74.900000000000006,61,51.8,45.2,40.200000000000003,36.4,33.299999999999997,30.8,28.7,27,25.5,24.2,23.1,22.1,21.2,20.399999999999999,19.7]
[22,288.2,146.80000000000001,99.6,76.099999999999994,62,52.6,45.9,40.799999999999997,36.9,33.799999999999997,31.3,29.2,27.4,25.9,24.6,23.4,22.4,21.5,20.7,20]
[23,292.60000000000002,149,101.1,77.2,62.9,53.4,46.6,41.5,37.5,34.299999999999997,31.8,29.6,27.8,26.3,24.9,23.8,22.7,21.8,21,20.3]
[24,297,151.19999999999999,102.7,78.400000000000006,63.9,54.2,47.3,42.1,38.1,34.9,32.200000000000003,30.1,28.2,26.7,25.3,24.1,23.1,22.2,21.4,20.6]
[25,301.5,153.5,104.2,79.599999999999994,64.8,55,48,42.7,38.6,35.4,32.700000000000003,30.5,28.7,27.1,25.7,24.5,23.4,22.5,21.7,20.9]
[26,306,155.80000000000001,105.8,80.8,65.8,55.8,48.7,43.4,39.200000000000003,35.9,33.200000000000003,31,29.1,27.5,26.1,24.9,23.8,22.9,22,21.3]
[27,310.7,158.19999999999999,107.4,82,66.8,56.7,49.4,44,39.799999999999997,36.5,33.700000000000003,31.5,29.5,27.9,26.5,25.2,24.2,23.2,22.3,21.6]
[28,315.3,160.6,109,83.2,67.8,57.5,50.2,44.7,40.4,37,34.200000000000003,31.9,30,28.3,26.9,25.6,24.5,23.6,22.7,21.9]
[29,320.10000000000002,163,110.7,84.5,68.8,58.4,50.9,45.4,41,37.6,34.799999999999997,32.4,30.4,28.8,27.3,26,24.9,23.9,23,22.3]
[30,324.89999999999998,165.4,112.3,85.8,69.900000000000006,59.3,51.7,46.1,41.7,38.200000000000003,35.299999999999997,32.9,30.9,29.2,27.7,26.4,25.3,24.3,23.4,22.6]
[31,329.8,167.9,114,87.1,70.900000000000006,60.2,52.5,46.7,42.3,38.700000000000003,35.799999999999997,33.4,31.4,29.6,28.1,26.8,25.7,24.7,23.8,22.9]
[32,334.7,170.4,115.7,88.4,72,61.1,53.3,47.5,42.9,39.299999999999997,36.4,33.9,31.9,30.1,28.6,27.2,26.1,25,24.1,23.3]
[33,339.7,173,117.5,89.7,73.099999999999994,62,54.1,48.2,43.6,39.9,36.9,34.4,32.299999999999997,30.6,29,27.7,26.5,25.4,24.5,23.7]
[34,344.8,175.6,119.2,91,74.2,62.9,54.9,48.9,44.2,40.5,37.5,35,32.799999999999997,31,29.5,28.1,26.9,25.8,24.9,24]
[35,349.9,178.2,121,92.4,75.3,63.9,55.7,49.6,44.9,41.1,38.1,35.5,33.299999999999997,31.5,29.9,28.5,27.3,26.2,25.3,24.4]
[36,355.2,180.9,122.8,93.8,76.400000000000006,64.8,56.6,50.4,45.6,41.8,38.6,36,33.9,32,30.4,29,27.7,26.6,25.7,24.8]
[37,360.4,183.6,124.6,95.2,77.599999999999994,65.8,57.4,51.1,46.3,42.4,39.200000000000003,36.6,34.4,32.5,30.8,29.4,28.2,27.1,26.1,25.2]
[38,365.8,186.3,126.5,96.6,78.7,66.8,58.3,51.9,47,43,39.799999999999997,37.200000000000003,34.9,33,31.3,29.9,28.6,27.5,26.5,25.6]
[39,371.3,189.1,128.4,98.1,79.900000000000006,67.8,59.2,52.7,47.7,43.7,40.4,37.700000000000003,35.5,33.5,31.8,30.4,29.1,27.9,26.9,26]
[40,376.8,191.9,130.30000000000001,99.5,81.099999999999994,68.8,60.1,53.5,48.4,44.4,41.1,38.299999999999997,36,34,32.299999999999997,30.8,29.6,28.4,27.4,""]
[41,382.4,194.8,132.30000000000001,101,82.3,69.900000000000006,61,54.3,49.2,45.1,41.7,38.9,36.6,34.6,32.9,31.4,30,28.9,"",""]
[42,388.1,197.7,134.30000000000001,102.6,83.6,70.900000000000006,61.9,55.2,49.9,45.8,42.4,39.5,37.200000000000003,35.1,33.4,31.9,30.5,"","",""]
[43,393.9,200.6,136.30000000000001,104.1,84.8,72,62.9,56,50.7,46.5,43,40.200000000000003,37.799999999999997,35.700000000000003,33.9,32.4,"","","",""]
[44,399.7,203.6,138.30000000000001,105.7,86.1,73.099999999999994,63.8,56.9,51.5,47.2,43.7,40.799999999999997,38.4,36.299999999999997,34.5,"","","","",""]
[45,405.7,206.7,140.4,107.3,87.4,74.2,64.8,57.8,52.3,48,44.4,41.5,39,36.9,"","","","","",""]
[46,411.7,209.8,142.5,108.9,88.8,75.400000000000006,65.8,58.7,53.2,48.7,45.1,42.2,39.700000000000003,"","","","","","",""]
[47,417.8,212.9,144.69999999999999,110.6,90.2,76.599999999999994,66.900000000000006,59.6,54,49.5,45.9,42.9,"","","","","","","",""]
[48,424,216.1,146.9,112.3,91.5,77.8,67.900000000000006,60.6,54.9,50.3,46.6,"","","","","","","","",""]
[49,430.3,219.4,149.1,114,93,79,69,61.6,55.8,51.2,"","","","","","","","","",""]
[50,436.7,222.6,151.30000000000001,115.7,94.4,80.2,70.099999999999994,62.5,56.7,"","","","","","","","","","",""]
[51,443.2,226,153.69999999999999,117.5,95.9,81.5,71.2,63.5,"","","","","","","","","","","",""]
[52,449.8,229.4,156,119.3,97.4,82.8,72.400000000000006,"","","","","","","","","","","","",""]
[53,456.6,232.9,158.4,121.2,98.9,84.1,"","","","","","","","","","","","","",""]
[54,463.5,236.5,160.9,123.1,100.5,"","","","","","","","","","","","","","",""]
[55,470.5,240.1,163.4,125,"","","","","","","","","","","","","","","",""]
[56,477.7,243.8,165.9,"","","","","","","","","","","","","","","","",""]
[57,485.2,247.7,"","","","","","","","","","","","","","","","","",""]
[58,492.8,"","","","","","","","","","","","","","","","","","",""]

{"sheet":"x-708","index":102,"n_rows":70,"n_cols":21,"rows_kept":70,"cut":false,"hidden":false,"merged":[]}
["Government Actuary's Department"]
[{"$f":"IF(title=\"> Enter workbook title here\",\"Enter workbook title in Cover sheet\",title)","v":"TPS (England & Wales) - Consolidated Factor Spreadsheet"}]
[{"$f":"TABLE_FACTOR_TYPE&\" - x-\"&TABLE_SERIES_NUMBER","v":"Added pension - x-708"}]
[]
[]
["Data Item","Factor Table Information"]
["Client","TPS_EW"]
["Section","All"]
["Factor Type","Added pension"]
["Description","Personal benefits, NPA 65. (Regular contribution elections made after 22 June 2010). Monthly contribution per £250 AP at date of election, £"]
["Gender","Unisex"]
["Factor Age/Period Definition","Age when notice of election given/ Payment period (in years)"]
["Section Number",0]
["Series Number",708]
["Table Reference","x-708"]
["Table Reference in Guidance","Table C65"]
["Associated Guidance Note","Teachers' Pension Scheme: Final salary sections and career average section\nPurchase of additional pension and ceasing monthly contribution elections: Factors and guidance\nDate: 24 June 2019"]
["Date Factors Issued to Client","2023-10-17"]
["Date Factors Implemented (if known)"]
["Factor Status","Issued"]
[]
[null,{"$f":"HYPERLINK(\"#'Factor List'!A1\",\"Back to Factor List\")","v":"Back to Factor List"}]
[]
[]
["Age",1,2,3,4,5,6,7,8,9,10,11,12,13,14,15,16,17,18,19,20]
[20,213.9,108.9,73.900000000000006,56.4,46,39,34,30.3,27.4,25.1,23.2,21.6,20.3,19.2,18.2,17.399999999999999,16.600000000000001,16,15.4,14.8]
[21,217,110.5,75,57.3,46.7,39.6,34.5,30.7,27.8,25.5,23.6,22,20.6,19.5,18.5,17.600000000000001,16.899999999999999,16.2,15.6,15.1]
[22,220.2,112.1,76.099999999999994,58.1,47.3,40.200000000000003,35,31.2,28.2,25.8,23.9,22.3,20.9,19.8,18.8,17.899999999999999,17.100000000000001,16.399999999999999,15.8,15.3]
[23,223.5,113.8,77.3,59,48,40.799999999999997,35.6,31.7,28.6,26.2,24.3,22.6,21.2,20.100000000000001,19,18.2,17.399999999999999,16.7,16.100000000000001,15.5]
[24,226.8,115.5,78.400000000000006,59.9,48.8,41.4,36.1,32.1,29.1,26.6,24.6,23,21.6,20.399999999999999,19.3,18.399999999999999,17.600000000000001,16.899999999999999,16.3,15.7]
[25,230.1,117.2,79.599999999999994,60.7,49.5,42,36.6,32.6,29.5,27,25,23.3,21.9,20.7,19.600000000000001,18.7,17.899999999999999,17.2,16.5,16]
[26,233.5,118.9,80.7,61.6,50.2,42.6,37.200000000000003,33.1,29.9,27.4,25.4,23.6,22.2,21,19.899999999999999,19,18.2,17.399999999999999,16.8,16.2]
[27,237,120.7,81.900000000000006,62.6,51,43.2,37.700000000000003,33.6,30.4,27.8,25.7,24,22.5,21.3,20.2,19.3,18.399999999999999,17.7,17,16.5]
[28,240.5,122.4,83.1,63.5,51.7,43.9,38.299999999999997,34.1,30.8,28.2,26.1,24.4,22.9,21.6,20.5,19.5,18.7,18,17.3,16.7]
[29,244,124.2,84.3,64.400000000000006,52.5,44.5,38.799999999999997,34.6,31.3,28.7,26.5,24.7,23.2,21.9,20.8,19.8,19,18.2,17.600000000000001,17]
[30,247.6,126.1,85.6,65.400000000000006,53.2,45.2,39.4,35.1,31.7,29.1,26.9,25.1,23.6,22.2,21.1,20.100000000000001,19.3,18.5,17.8,17.2]
[31,251.2,127.9,86.8,66.3,54,45.8,40,35.6,32.200000000000003,29.5,27.3,25.5,23.9,22.6,21.4,20.399999999999999,19.600000000000001,18.8,18.100000000000001,17.5]
[32,254.9,129.80000000000001,88.1,67.3,54.8,46.5,40.6,36.1,32.700000000000003,29.9,27.7,25.8,24.3,22.9,21.8,20.7,19.899999999999999,19.100000000000001,18.399999999999999,17.7]
[33,258.60000000000002,131.69999999999999,89.4,68.3,55.6,47.2,41.2,36.700000000000003,33.200000000000003,30.4,28.1,26.2,24.6,23.3,22.1,21.1,20.2,19.399999999999999,18.7,18]
[34,262.39999999999998,133.6,90.7,69.3,56.4,47.9,41.8,37.200000000000003,33.700000000000003,30.8,28.5,26.6,25,23.6,22.4,21.4,20.5,19.7,18.899999999999999,18.3]
[35,266.2,135.6,92.1,70.3,57.3,48.6,42.4,37.799999999999997,34.200000000000003,31.3,29,27,25.4,24,22.8,21.7,20.8,20,19.2,18.600000000000001]
[36,270.10000000000002,137.6,93.4,71.3,58.1,49.3,43,38.299999999999997,34.700000000000003,31.8,29.4,27.4,25.7,24.3,23.1,22,21.1,20.3,19.5,18.899999999999999]
[37,274.10000000000002,139.6,94.8,72.400000000000006,59,50,43.7,38.9,35.200000000000003,32.200000000000003,29.8,27.8,26.1,24.7,23.5,22.4,21.4,20.6,19.8,19.2]
[38,278.10000000000002,141.6,96.2,73.5,59.8,50.8,44.3,39.5,35.700000000000003,32.700000000000003,30.3,28.2,26.5,25.1,23.8,22.7,21.8,20.9,20.2,19.5]
[39,282.10000000000002,143.69999999999999,97.6,74.5,60.7,51.5,45,40.1,36.299999999999997,33.200000000000003,30.7,28.7,26.9,25.5,24.2,23.1,22.1,21.2,20.5,19.8]
[40,286.3,145.80000000000001,99,75.599999999999994,61.6,52.3,45.6,40.700000000000003,36.799999999999997,33.700000000000003,31.2,29.1,27.4,25.9,24.6,23.4,22.5,21.6,20.8,20.100000000000001]
[41,290.39999999999998,147.9,100.5,76.7,62.5,53.1,46.3,41.3,37.4,34.200000000000003,31.7,29.6,27.8,26.3,25,23.8,22.8,21.9,21.1,20.399999999999999]
[42,294.7,150.1,101.9,77.900000000000006,63.5,53.9,47,41.9,37.9,34.799999999999997,32.200000000000003,30,28.2,26.7,25.3,24.2,23.2,22.3,21.5,20.8]
[43,299,152.30000000000001,103.4,79,64.400000000000006,54.7,47.7,42.5,38.5,35.299999999999997,32.700000000000003,30.5,28.7,27.1,25.8,24.6,23.6,22.7,21.9,21.1]
[44,303.3,154.5,105,80.2,65.400000000000006,55.5,48.4,43.2,39.1,35.799999999999997,33.200000000000003,31,29.1,27.5,26.2,25,24,23,22.2,21.5]
[45,307.7,156.80000000000001,106.5,81.400000000000006,66.3,56.3,49.2,43.8,39.700000000000003,36.4,33.700000000000003,31.5,29.6,28,26.6,25.4,24.3,23.4,22.6,21.9]
[46,312.2,159.1,108.1,82.6,67.3,57.2,49.9,44.5,40.299999999999997,37,34.200000000000003,32,30.1,28.4,27,25.8,24.8,23.8,23]
[47,316.7,161.4,109.7,83.8,68.3,58,50.7,45.2,40.9,37.6,34.799999999999997,32.5,30.6,28.9,27.5,26.3,25.2,24.2]
[48,321.3,163.80000000000001,111.3,85.1,69.400000000000006,58.9,51.5,45.9,41.6,38.1,35.299999999999997,33,31.1,29.4,28,26.7,25.6]
[49,325.89999999999998,166.1,112.9,86.3,70.400000000000006,59.8,52.3,46.6,42.2,38.799999999999997,35.9,33.6,31.6,29.9,28.4,27.2]
[50,330.6,168.6,114.6,87.6,71.5,60.7,53.1,47.3,42.9,39.4,36.5,34.1,32.1,30.4,28.9]
[51,335.4,171,116.3,88.9,72.599999999999994,61.7,53.9,48.1,43.6,40,37.1,34.700000000000003,32.6,30.9]
[52,340.2,173.5,118,90.3,73.7,62.6,54.7,48.8,44.3,40.6,37.700000000000003,35.200000000000003,33.200000000000003]
[53,345.1,176,119.7,91.6,74.8,63.6,55.6,49.6,45,41.3,38.299999999999997,35.799999999999997]
[54,350.1,178.6,121.5,93,75.900000000000006,64.5,56.4,50.4,45.7,42,39]
[55,355.2,181.3,123.3,94.4,77.099999999999994,65.5,57.3,51.2,46.4,42.7]
[56,360.4,184,125.2,95.8,78.3,66.599999999999994,58.2,52,47.2]
[57,365.8,186.7,127.1,97.3,79.5,67.599999999999994,59.2,52.9]
[58,371.3,189.6,129.1,98.9,80.8,68.7,60.2]
[59,377,192.5,131.1,100.4,82.1,69.900000000000006]
[60,382.9,195.6,133.19999999999999,102.1,83.5]
[61,388.9,198.7,135.4,103.8]
[62,395.3,202,137.69999999999999]
[63,402,205.5]
[64,408.9]

{"sheet":"x-709","index":103,"n_rows":70,"n_cols":21,"rows_kept":70,"cut":false,"hidden":false,"merged":[]}
["Government Actuary's Department"]
[{"$f":"IF(title=\"> Enter workbook title here\",\"Enter workbook title in Cover sheet\",title)","v":"TPS (England & Wales) - Consolidated Factor Spreadsheet"}]
[{"$f":"TABLE_FACTOR_TYPE&\" - x-\"&TABLE_SERIES_NUMBER","v":"Added pension - x-709"}]
[]
[]
["Data Item","Factor Table Information"]
["Client","TPS_EW"]
["Section","All"]
["Factor Type","Added pension"]
["Description","Personal and dependant's benefits, NPA 65. (Regular contribution elections made after 22 June 2010). Monthly contribution per £250 AP at date of election, £"]
["Gender","Unisex"]
["Factor Age/Period Definition","Age when notice of election given/ Payment period (in years)"]
["Section Number",0]
["Series Number",709]
["Table Reference","x-709"]
["Table Reference in Guidance","Table C65D"]
["Associated Guidance Note","Teachers' Pension Scheme: Final salary sections and career average section\nPurchase of additional pension and ceasing monthly contribution elections: Factors and guidance\nDate: 24 June 2019"]
["Date Factors Issued to Client","2023-10-17"]
["Date Factors Implemented (if known)"]
["Factor Status","Issued"]
[]
[null,{"$f":"HYPERLINK(\"#'Factor List'!A1\",\"Back to Factor List\")","v":"Back to Factor List"}]
[]
[]
["Age",1,2,3,4,5,6,7,8,9,10,11,12,13,14,15,16,17,18,19,20]
[20,231.8,118,80.099999999999994,61.2,49.8,42.3,36.9,32.799999999999997,29.7,27.2,25.2,23.5,22,20.8,19.7,18.8,18,17.3,16.7,16.100000000000001]
[21,235.3,119.8,81.3,62.1,50.6,42.9,37.4,33.299999999999997,30.1,27.6,25.5,23.8,22.4,21.1,20,19.100000000000001,18.3,17.600000000000001,16.899999999999999,16.3]
[22,238.8,121.6,82.5,63,51.3,43.5,38,33.799999999999997,30.6,28,25.9,24.2,22.7,21.4,20.3,19.399999999999999,18.600000000000001,17.8,17.2,16.600000000000001]
[23,242.3,123.4,83.8,64,52.1,44.2,38.5,34.299999999999997,31.1,28.4,26.3,24.5,23,21.7,20.6,19.7,18.8,18.100000000000001,17.399999999999999,16.8]
[24,245.9,125.2,85,64.900000000000006,52.9,44.8,39.1,34.799999999999997,31.5,28.9,26.7,24.9,23.4,22.1,21,20,19.100000000000001,18.399999999999999,17.7,17.100000000000001]
[25,249.5,127.1,86.3,65.900000000000006,53.6,45.5,39.700000000000003,35.4,32,29.3,27.1,25.3,23.7,22.4,21.3,20.3,19.399999999999999,18.600000000000001,17.899999999999999,17.3]
[26,253.2,128.9,87.5,66.8,54.4,46.2,40.299999999999997,35.9,32.5,29.7,27.5,25.6,24.1,22.7,21.6,20.6,19.7,18.899999999999999,18.2,17.600000000000001]
[27,256.89999999999998,130.80000000000001,88.8,67.8,55.2,46.9,40.9,36.4,32.9,30.2,27.9,26,24.4,23.1,21.9,20.9,20,19.2,18.5,17.899999999999999]
[28,260.7,132.80000000000001,90.1,68.8,56.1,47.6,41.5,37,33.4,30.6,28.3,26.4,24.8,23.4,22.2,21.2,20.3,19.5,18.8,18.100000000000001]
[29,264.60000000000002,134.69999999999999,91.5,69.8,56.9,48.3,42.1,37.5,33.9,31.1,28.7,26.8,25.2,23.8,22.6,21.5,20.6,19.8,19,18.399999999999999]
[30,268.39999999999998,136.69999999999999,92.8,70.900000000000006,57.7,49,42.7,38.1,34.4,31.5,29.2,27.2,25.5,24.1,22.9,21.8,20.9,20.100000000000001,19.3,18.7]
[31,272.39999999999998,138.69999999999999,94.2,71.900000000000006,58.6,49.7,43.4,38.6,34.9,32,29.6,27.6,25.9,24.5,23.2,22.2,21.2,20.399999999999999,19.600000000000001,19]
[32,276.3,140.69999999999999,95.5,73,59.4,50.4,44,39.200000000000003,35.4,32.5,30,28,26.3,24.8,23.6,22.5,21.5,20.7,19.899999999999999,19.2]
[33,280.39999999999998,142.80000000000001,96.9,74,60.3,51.2,44.6,39.799999999999997,36,32.9,30.5,28.4,26.7,25.2,23.9,22.8,21.9,21,20.2,19.5]
[34,284.5,144.9,98.4,75.099999999999994,61.2,51.9,45.3,40.299999999999997,36.5,33.4,30.9,28.8,27.1,25.6,24.3,23.2,22.2,21.3,20.5,19.8]
[35,288.60000000000002,147,99.8,76.2,62.1,52.7,46,40.9,37,33.9,31.4,29.3,27.5,26,24.7,23.5,22.5,21.6,20.8,20.100000000000001]
[36,292.8,149.1,101.2,77.3,63,53.4,46.6,41.5,37.6,34.4,31.9,29.7,27.9,26.4,25,23.9,22.9,22,21.2,20.5]
[37,297,151.30000000000001,102.7,78.400000000000006,63.9,54.2,47.3,42.1,38.1,34.9,32.299999999999997,30.2,28.3,26.8,25.4,24.2,23.2,22.3,21.5,20.8]
[38,301.3,153.5,104.2,79.599999999999994,64.8,55,48,42.8,38.700000000000003,35.5,32.799999999999997,30.6,28.8,27.2,25.8,24.6,23.6,22.7,21.8,21.1]
[39,305.7,155.69999999999999,105.7,80.7,65.8,55.8,48.7,43.4,39.299999999999997,36,33.299999999999997,31.1,29.2,27.6,26.2,25,23.9,23,22.2,21.4]
[40,310.10000000000002,157.9,107.2,81.900000000000006,66.7,56.6,49.4,44,39.9,36.5,33.799999999999997,31.5,29.6,28,26.6,25.4,24.3,23.4,22.5,21.8]
[41,314.5,160.19999999999999,108.8,83.1,67.7,57.5,50.2,44.7,40.5,37.1,34.299999999999997,32,30.1,28.4,27,25.8,24.7,23.7,22.9,22.1]
[42,319.10000000000002,162.5,110.4,84.3,68.7,58.3,50.9,45.4,41.1,37.6,34.799999999999997,32.5,30.6,28.9,27.4,26.2,25.1,24.1,23.3,22.5]
[43,323.60000000000002,164.9,112,85.6,69.7,59.2,51.7,46,41.7,38.200000000000003,35.4,33,31,29.3,27.9,26.6,25.5,24.5,23.7,22.9]
[44,328.3,167.2,113.6,86.8,70.7,60,52.4,46.7,42.3,38.799999999999997,35.9,33.5,31.5,29.8,28.3,27,25.9,24.9,24,23.3]
[45,333,169.6,115.2,88.1,71.8,60.9,53.2,47.4,43,39.4,36.5,34.1,32,30.3,28.8,27.5,26.3,25.3,24.4,23.6]
[46,337.7,172.1,116.9,89.3,72.8,61.8,54,48.1,43.6,40,37,34.6,32.5,30.8,29.3,27.9,26.8,25.8,24.8,""]
[47,342.5,174.5,118.6,90.6,73.900000000000006,62.8,54.8,48.9,44.3,40.6,37.6,35.1,33,31.3,29.7,28.4,27.2,26.2,"",""]
[48,347.3,177,120.3,92,75,63.7,55.6,49.6,45,41.2,38.200000000000003,35.700000000000003,33.6,31.8,30.2,28.9,27.7,"","",""]
[49,352.2,179.5,122,93.3,76.099999999999994,64.599999999999994,56.5,50.4,45.6,41.9,38.799999999999997,36.299999999999997,34.1,32.299999999999997,30.7,29.3,"","","",""]
[50,357.1,182.1,123.8,94.6,77.2,65.599999999999994,57.3,51.1,46.3,42.5,39.4,36.799999999999997,34.700000000000003,32.799999999999997,31.2,"","","","",""]
[51,362.1,184.6,125.5,96,78.3,66.599999999999994,58.2,51.9,47.1,43.2,40,37.4,35.200000000000003,33.299999999999997,"","","","","",""]
[52,367.1,187.2,127.3,97.4,79.5,67.599999999999994,59.1,52.7,47.8,43.9,40.700000000000003,38,35.799999999999997,"","","","","","",""]
[53,372.2,189.9,129.1,98.8,80.599999999999994,68.599999999999994,59.9,53.5,48.5,44.5,41.3,38.6,"","","","","","","",""]
[54,377.4,192.6,131,100.3,81.8,69.599999999999994,60.9,54.3,49.3,45.2,42,"","","","","","","","",""]
[55,382.7,195.3,132.9,101.7,83,70.599999999999994,61.8,55.2,50,46,"","","","","","","","","",""]
[56,388.1,198.1,134.80000000000001,103.2,84.3,71.7,62.7,56,50.8,"","","","","","","","","","",""]
[57,393.6,200.9,136.80000000000001,104.7,85.5,72.8,63.7,56.9,"","","","","","","","","","","",""]
[58,399.3,203.9,138.80000000000001,106.3,86.8,73.900000000000006,64.7,"","","","","","","","","","","","",""]
[59,405.1,206.9,140.9,107.9,88.2,75.099999999999994,"","","","","","","","","","","","","",""]
[60,411.1,210,143,109.6,89.6,"","","","","","","","","","","","","","",""]
[61,417.3,213.2,145.19999999999999,111.4,"","","","","","","","","","","","","","","",""]
[62,423.7,216.5,147.6,"","","","","","","","","","","","","","","","",""]
[63,430.5,220,"","","","","","","","","","","","","","","","","",""]
[64,437.4,"","","","","","","","","","","","","","","","","","",""]

{"sheet":"x-710","index":104,"n_rows":71,"n_cols":21,"rows_kept":71,"cut":false,"hidden":false,"merged":[]}
["Government Actuary's Department"]
[{"$f":"IF(title=\"> Enter workbook title here\",\"Enter workbook title in Cover sheet\",title)","v":"TPS (England & Wales) - Consolidated Factor Spreadsheet"}]
[{"$f":"TABLE_FACTOR_TYPE&\" - x-\"&TABLE_SERIES_NUMBER","v":"Added pension - x-710"}]
[]
[]
["Data Item","Factor Table Information"]
["Client","TPS_EW"]
["Section","Career Average"]
["Factor Type","Added pension"]
["Description","Personal benefits, NPA 66. (Regular contribution elections made after 22 June 2010) Monthly contribution per £250 AP at date of election, £"]
["Gender","Unisex"]
["Factor Age/Period Definition","Age when notice of election given/ Payment period (in years)"]
["Section Number",0]
["Series Number",710]
["Table Reference","x-710"]
["Table Reference in Guidance","Table C66"]
["Associated Guidance Note","Teachers' Pension Scheme: Final salary sections and career average section\nPurchase of additional pension and ceasing monthly contribution elections: Factors and guidance\nDate: 24 June 2019"]
["Date Factors Issued to Client","2023-10-17"]
["Date Factors Implemented (if known)"]
["Factor Status","Issued"]
[]
[null,{"$f":"HYPERLINK(\"#'Factor List'!A1\",\"Back to Factor List\")","v":"Back to Factor List"}]
[]
[]
["Age",1,2,3,4,5,6,7,8,9,10,11,12,13,14,15,16,17,18,19,20]
[20,205.8,104.8,71.099999999999994,54.3,44.2,37.5,32.700000000000003,29.2,26.4,24.1,22.3,20.8,19.600000000000001,18.5,17.5,16.7,16,15.4,14.8,14.3]
[21,208.8,106.3,72.2,55.1,44.9,38.1,33.200000000000003,29.6,26.8,24.5,22.7,21.1,19.8,18.7,17.8,17,16.2,15.6,15,14.5]
[22,211.9,107.9,73.2,55.9,45.6,38.6,33.700000000000003,30,27.2,24.9,23,21.4,20.100000000000001,19,18.100000000000001,17.2,16.5,15.8,15.2,14.7]
[23,215,109.5,74.3,56.8,46.2,39.200000000000003,34.200000000000003,30.5,27.6,25.2,23.3,21.8,20.399999999999999,19.3,18.3,17.5,16.7,16,15.5,14.9]
[24,218.2,111.1,75.400000000000006,57.6,46.9,39.799999999999997,34.700000000000003,30.9,28,25.6,23.7,22.1,20.7,19.600000000000001,18.600000000000001,17.7,17,16.3,15.7,15.1]
[25,221.4,112.7,76.5,58.4,47.6,40.4,35.200000000000003,31.4,28.4,26,24,22.4,21,19.899999999999999,18.899999999999999,18,17.2,16.5,15.9,15.4]
[26,224.7,114.4,77.7,59.3,48.3,41,35.700000000000003,31.8,28.8,26.4,24.4,22.7,21.4,20.2,19.100000000000001,18.3,17.5,16.8,16.2,15.6]
[27,228,116.1,78.8,60.2,49,41.6,36.299999999999997,32.299999999999997,29.2,26.8,24.8,23.1,21.7,20.5,19.399999999999999,18.5,17.7,17,16.399999999999999,15.8]
[28,231.3,117.8,80,61.1,49.7,42.2,36.799999999999997,32.799999999999997,29.7,27.2,25.1,23.4,22,20.8,19.7,18.8,18,17.3,16.600000000000001,16.100000000000001]
[29,234.7,119.5,81.099999999999994,62,50.5,42.8,37.4,33.299999999999997,30.1,27.6,25.5,23.8,22.3,21.1,20,19.100000000000001,18.3,17.5,16.899999999999999,16.3]
[30,238.1,121.3,82.3,62.9,51.2,43.4,37.9,33.799999999999997,30.5,28,25.9,24.1,22.7,21.4,20.3,19.399999999999999,18.5,17.8,17.100000000000001,16.600000000000001]
[31,241.6,123,83.5,63.8,52,44.1,38.5,34.299999999999997,31,28.4,26.3,24.5,23,21.7,20.6,19.7,18.8,18.100000000000001,17.399999999999999,16.8]
[32,245.1,124.8,84.7,64.7,52.7,44.7,39,34.799999999999997,31.4,28.8,26.6,24.8,23.3,22,20.9,20,19.100000000000001,18.3,17.7,17.100000000000001]
[33,248.7,126.7,86,65.7,53.5,45.4,39.6,35.299999999999997,31.9,29.2,27,25.2,23.7,22.4,21.2,20.3,19.399999999999999,18.600000000000001,17.899999999999999,17.3]
[34,252.3,128.5,87.2,66.599999999999994,54.3,46,40.200000000000003,35.799999999999997,32.4,29.7,27.4,25.6,24,22.7,21.6,20.6,19.7,18.899999999999999,18.2,17.600000000000001]
[35,256,130.4,88.5,67.599999999999994,55.1,46.7,40.799999999999997,36.299999999999997,32.9,30.1,27.8,26,24.4,23,21.9,20.9,20,19.2,18.5,17.899999999999999]
[36,259.7,132.30000000000001,89.8,68.599999999999994,55.9,47.4,41.4,36.799999999999997,33.299999999999997,30.5,28.3,26.4,24.8,23.4,22.2,21.2,20.3,19.5,18.8,18.100000000000001]
[37,263.5,134.19999999999999,91.1,69.599999999999994,56.7,48.1,42,37.4,33.799999999999997,31,28.7,26.8,25.1,23.7,22.5,21.5,20.6,19.8,19.100000000000001,18.399999999999999]
[38,267.3,136.19999999999999,92.4,70.599999999999994,57.5,48.8,42.6,37.9,34.299999999999997,31.5,29.1,27.2,25.5,24.1,22.9,21.8,20.9,20.100000000000001,19.399999999999999,18.7]
[39,271.2,138.1,93.8,71.599999999999994,58.4,49.5,43.2,38.5,34.799999999999997,31.9,29.5,27.6,25.9,24.5,23.2,22.2,21.2,20.399999999999999,19.7,19]
[40,275.2,140.1,95.2,72.7,59.2,50.3,43.9,39.1,35.4,32.4,30,28,26.3,24.9,23.6,22.5,21.6,20.7,20,19.3]
[41,279.2,142.19999999999999,96.6,73.8,60.1,51,44.5,39.700000000000003,35.9,32.9,30.4,28.4,26.7,25.2,24,22.9,21.9,21.1,20.3,19.600000000000001]
[42,283.2,144.30000000000001,98,74.8,61,51.8,45.2,40.299999999999997,36.4,33.4,30.9,28.9,27.1,25.6,24.4,23.3,22.3,21.4,20.7,20]
[43,287.3,146.4,99.4,75.900000000000006,61.9,52.5,45.9,40.9,37,33.9,31.4,29.3,27.5,26,24.8,23.6,22.6,21.8,21,20.3]
[44,291.5,148.5,100.9,77.099999999999994,62.8,53.3,46.5,41.5,37.6,34.4,31.9,29.8,28,26.5,25.2,24,23,22.1,21.3,20.6]
[45,295.7,150.6,102.3,78.2,63.7,54.1,47.3,42.1,38.1,35,32.4,30.2,28.4,26.9,25.6,24.4,23.4,22.5,21.7,21]
[46,299.89999999999998,152.80000000000001,103.8,79.3,64.7,54.9,48,42.8,38.700000000000003,35.5,32.9,30.7,28.9,27.3,26,24.8,23.8,22.9,22.1,21.4]
[47,304.2,155,105.3,80.5,65.599999999999994,55.7,48.7,43.4,39.299999999999997,36.1,33.4,31.2,29.4,27.8,26.4,25.2,24.2,23.3,22.4]
[48,308.60000000000002,157.30000000000001,106.9,81.7,66.599999999999994,56.6,49.4,44.1,39.9,36.6,33.9,31.7,29.8,28.2,26.8,25.6,24.6,23.7]
[49,313,159.5,108.4,82.9,67.599999999999994,57.4,50.2,44.8,40.6,37.200000000000003,34.5,32.200000000000003,30.3,28.7,27.3,26.1,25]
[50,317.39999999999998,161.80000000000001,110,84.1,68.599999999999994,58.3,51,45.5,41.2,37.799999999999997,35,32.700000000000003,30.8,29.2,27.7,26.5]
[51,321.89999999999998,164.2,111.6,85.4,69.599999999999994,59.2,51.7,46.2,41.8,38.4,35.6,33.299999999999997,31.3,29.6,28.2]
[52,326.5,166.5,113.2,86.6,70.7,60.1,52.5,46.9,42.5,39,36.200000000000003,33.799999999999997,31.8,30.1]
[53,331.1,168.9,114.9,87.9,71.7,61,53.3,47.6,43.2,39.6,36.700000000000003,34.299999999999997,32.4]
[54,335.8,171.3,116.6,89.2,72.8,61.9,54.1,48.3,43.8,40.200000000000003,37.299999999999997,34.9]
[55,340.6,173.8,118.3,90.5,73.900000000000006,62.9,55,49.1,44.5,40.9,38]
[56,345.5,176.3,120,91.9,75,63.8,55.8,49.9,45.2,41.6]
[57,350.5,179,121.8,93.3,76.2,64.8,56.7,50.7,46]
[58,355.7,181.6,123.7,94.7,77.400000000000006,65.8,57.6,51.5]
[59,361.1,184.4,125.6,96.2,78.599999999999994,66.900000000000006,58.6]
[60,366.6,187.2,127.5,97.7,79.900000000000006,68]
[61,372.3,190.2,129.6,99.3,81.2]
[62,378.2,193.3,131.69999999999999,101]
[63,384.4,196.5,133.9]
[64,390.7,199.8]
[65,397.3]

{"sheet":"x-711","index":105,"n_rows":71,"n_cols":21,"rows_kept":71,"cut":false,"hidden":false,"merged":[]}
["Government Actuary's Department"]
[{"$f":"IF(title=\"> Enter workbook title here\",\"Enter workbook title in Cover sheet\",title)","v":"TPS (England & Wales) - Consolidated Factor Spreadsheet"}]
[{"$f":"TABLE_FACTOR_TYPE&\" - x-\"&TABLE_SERIES_NUMBER","v":"Added pension - x-711"}]
[]
[]
["Data Item","Factor Table Information"]
["Client","TPS_EW"]
["Section","Career Average"]
["Factor Type","Added pension"]
["Description","Personal and dependant's benefits, NPA 66. (Regular contribution elections made after 22 June 2010) Monthly contribution per £250 AP at date of election, £"]
["Gender","Unisex"]
["Factor Age/Period Definition","Age when notice of election given/ Payment period (in years)"]
["Section Number",0]
["Series Number",711]
["Table Reference","x-711"]
["Table Reference in Guidance","Table C66D"]
["Associated Guidance Note","Teachers' Pension Scheme: Final salary sections and career average section\nPurchase of additional pension and ceasing monthly contribution elections: Factors and guidance\nDate: 24 June 2019"]
["Date Factors Issued to Client","2023-10-17"]
["Date Factors Implemented (if known)"]
["Factor Status","Issued"]
[]
[null,{"$f":"HYPERLINK(\"#'Factor List'!A1\",\"Back to Factor List\")","v":"Back to Factor List"}]
[]
[]
["Age",1,2,3,4,5,6,7,8,9,10,11,12,13,14,15,16,17,18,19,20]
[20,223.8,114,77.400000000000006,59.1,48.1,40.799999999999997,35.6,31.7,28.7,26.3,24.3,22.6,21.3,20.100000000000001,19.100000000000001,18.2,17.399999999999999,16.7,16.100000000000001,15.5]
[21,227.1,115.7,78.5,60,48.8,41.4,36.1,32.200000000000003,29.1,26.7,24.7,23,21.6,20.399999999999999,19.3,18.399999999999999,17.600000000000001,16.899999999999999,16.3,15.8]
[22,230.5,117.4,79.7,60.8,49.5,42,36.700000000000003,32.700000000000003,29.5,27,25,23.3,21.9,20.7,19.600000000000001,18.7,17.899999999999999,17.2,16.600000000000001,16]
[23,233.9,119.1,80.8,61.7,50.3,42.7,37.200000000000003,33.1,30,27.4,25.4,23.7,22.2,21,19.899999999999999,19,18.2,17.5,16.8,16.2]
[24,237.3,120.9,82,62.6,51,43.3,37.799999999999997,33.6,30.4,27.9,25.8,24,22.6,21.3,20.2,19.3,18.5,17.7,17.100000000000001,16.5]
[25,240.8,122.6,83.3,63.6,51.8,43.9,38.299999999999997,34.1,30.9,28.3,26.1,24.4,22.9,21.6,20.5,19.600000000000001,18.7,18,17.3,16.7]
[26,244.4,124.4,84.5,64.5,52.5,44.6,38.9,34.6,31.3,28.7,26.5,24.7,23.2,21.9,20.8,19.899999999999999,19,18.2,17.600000000000001,17]
[27,248,126.3,85.7,65.5,53.3,45.2,39.5,35.1,31.8,29.1,26.9,25.1,23.6,22.3,21.1,20.2,19.3,18.5,17.8,17.2]
[28,251.6,128.1,87,66.400000000000006,54.1,45.9,40,35.700000000000003,32.299999999999997,29.5,27.3,25.5,23.9,22.6,21.5,20.5,19.600000000000001,18.8,18.100000000000001,17.5]
[29,255.3,130,88.3,67.400000000000006,54.9,46.6,40.6,36.200000000000003,32.700000000000003,30,27.7,25.9,24.3,22.9,21.8,20.8,19.899999999999999,19.100000000000001,18.399999999999999,17.8]
[30,259,131.9,89.6,68.400000000000006,55.7,47.3,41.2,36.700000000000003,33.200000000000003,30.4,28.1,26.2,24.6,23.3,22.1,21.1,20.2,19.399999999999999,18.7,18]
[31,262.8,133.80000000000001,90.9,69.400000000000006,56.5,47.9,41.8,37.299999999999997,33.700000000000003,30.9,28.6,26.6,25,23.6,22.4,21.4,20.5,19.7,18.899999999999999,18.3]
[32,266.60000000000002,135.80000000000001,92.2,70.400000000000006,57.3,48.6,42.4,37.799999999999997,34.200000000000003,31.3,29,27,25.4,24,22.8,21.7,20.8,20,19.2,18.600000000000001]
[33,270.5,137.80000000000001,93.5,71.400000000000006,58.2,49.4,43.1,38.4,34.700000000000003,31.8,29.4,27.4,25.8,24.3,23.1,22,21.1,20.3,19.5,18.899999999999999]
[34,274.39999999999998,139.80000000000001,94.9,72.5,59,50.1,43.7,38.9,35.200000000000003,32.299999999999997,29.8,27.8,26.1,24.7,23.4,22.4,21.4,20.6,19.8,19.100000000000001]
[35,278.39999999999998,141.80000000000001,96.3,73.5,59.9,50.8,44.3,39.5,35.700000000000003,32.700000000000003,30.3,28.2,26.5,25.1,23.8,22.7,21.7,20.9,20.100000000000001,19.399999999999999]
[36,282.39999999999998,143.80000000000001,97.7,74.599999999999994,60.8,51.6,45,40.1,36.299999999999997,33.200000000000003,30.7,28.7,26.9,25.4,24.2,23,22.1,21.2,20.399999999999999,19.7]
[37,286.5,145.9,99.1,75.7,61.6,52.3,45.6,40.700000000000003,36.799999999999997,33.700000000000003,31.2,29.1,27.3,25.8,24.5,23.4,22.4,21.5,20.7,20]
[38,290.60000000000002,148,100.5,76.8,62.5,53.1,46.3,41.2,37.299999999999997,34.200000000000003,31.6,29.5,27.7,26.2,24.9,23.7,22.7,21.8,21.1,20.399999999999999]
[39,294.8,150.1,102,77.900000000000006,63.4,53.8,47,41.9,37.9,34.700000000000003,32.1,30,28.1,26.6,25.3,24.1,23.1,22.2,21.4,20.7]
[40,299,152.30000000000001,103.4,79,64.400000000000006,54.6,47.7,42.5,38.4,35.200000000000003,32.6,30.4,28.6,27,25.7,24.5,23.5,22.5,21.7,21]
[41,303.3,154.5,104.9,80.099999999999994,65.3,55.4,48.4,43.1,39,35.700000000000003,33.1,30.9,29,27.4,26.1,24.9,23.8,22.9,22.1,21.3]
[42,307.60000000000002,156.69999999999999,106.4,81.3,66.2,56.2,49.1,43.7,39.6,36.299999999999997,33.6,31.3,29.5,27.9,26.5,25.3,24.2,23.3,22.4,21.7]
[43,312,158.9,108,82.5,67.2,57,49.8,44.4,40.200000000000003,36.799999999999997,34.1,31.8,29.9,28.3,26.9,25.7,24.6,23.6,22.8,22.1]
[44,316.5,161.19999999999999,109.5,83.7,68.2,57.9,50.5,45,40.799999999999997,37.4,34.6,32.299999999999997,30.4,28.7,27.3,26.1,25,24,23.2,22.4]
[45,320.89999999999998,163.5,111.1,84.9,69.2,58.7,51.3,45.7,41.4,38,35.1,32.799999999999997,30.9,29.2,27.7,26.5,25.4,24.4,23.6,22.8]
[46,325.5,165.8,112.7,86.1,70.2,59.6,52.1,46.4,42,38.5,35.700000000000003,33.299999999999997,31.3,29.7,28.2,26.9,25.8,24.8,24,23.2]
[47,330,168.2,114.3,87.3,71.2,60.5,52.8,47.1,42.7,39.1,36.200000000000003,33.9,31.8,30.1,28.6,27.4,26.2,25.2,24.3]
[48,334.6,170.6,115.9,88.6,72.3,61.4,53.6,47.8,43.3,39.700000000000003,36.799999999999997,34.4,32.299999999999997,30.6,29.1,27.8,26.7,25.6]
[49,339.3,173,117.5,89.9,73.3,62.3,54.4,48.5,44,40.299999999999997,37.4,34.9,32.9,31.1,29.6,28.3,27.1]
[50,344,175.4,119.2,91.2,74.400000000000006,63.2,55.2,49.3,44.6,41,38,35.5,33.4,31.6,30.1,28.7]
[51,348.7,177.8,120.9,92.5,75.400000000000006,64.099999999999994,56,50,45.3,41.6,38.5,36,33.9,32.1,30.5]
[52,353.5,180.3,122.6,93.8,76.5,65,56.9,50.7,46,42.2,39.1,36.6,34.4,32.6]
[53,358.3,182.8,124.3,95.1,77.599999999999994,66,57.7,51.5,46.7,42.9,39.799999999999997,37.200000000000003,35]
[54,363.2,185.3,126.1,96.5,78.7,67,58.6,52.3,47.4,43.5,40.4,37.799999999999997]
[55,368.2,187.9,127.8,97.8,79.900000000000006,67.900000000000006,59.4,53.1,48.1,44.2,41]
[56,373.2,190.5,129.6,99.2,81,68.900000000000006,60.3,53.9,48.9,44.9]
[57,378.4,193.2,131.5,100.7,82.2,70,61.2,54.7,49.6]
[58,383.7,195.9,133.4,102.2,83.5,71,62.2,55.6]
[59,389.2,198.8,135.30000000000001,103.7,84.7,72.099999999999994,63.1]
[60,394.8,201.7,137.4,105.2,86,73.2]
[61,400.6,204.7,139.4,106.9,87.4]
[62,406.6,207.8,141.6,108.6]
[63,412.9,211,143.80000000000001]
[64,419.3,214.4]
[65,426]

{"sheet":"x-712","index":106,"n_rows":72,"n_cols":21,"rows_kept":72,"cut":false,"hidden":false,"merged":[]}
["Government Actuary's Department"]
[{"$f":"IF(title=\"> Enter workbook title here\",\"Enter workbook title in Cover sheet\",title)","v":"TPS (England & Wales) - Consolidated Factor Spreadsheet"}]
[{"$f":"TABLE_FACTOR_TYPE&\" - x-\"&TABLE_SERIES_NUMBER","v":"Added pension - x-712"}]
[]
[]
["Data Item","Factor Table Information"]
["Client","TPS_EW"]
["Section","Career Average"]
["Factor Type","Added pension"]
["Description","Personal benefits, NPA 67. (Regular contribution elections made after 22 June 2010) Monthly contribution per £250 AP at date of election, £"]
["Gender","Unisex"]
["Factor Age/Period Definition","Age when notice of election given/ Payment period (in years)"]
["Section Number",0]
["Series Number",712]
["Table Reference","x-712"]
["Table Reference in Guidance","Table C67"]
["Associated Guidance Note","Teachers' Pension Scheme: Final salary sections and career average section\nPurchase of additional pension and ceasing monthly contribution elections: Factors and guidance\nDate: 24 June 2019"]
["Date Factors Issued to Client","2023-10-17"]
["Date Factors Implemented (if known)"]
["Factor Status","Issued"]
[]
[null,{"$f":"HYPERLINK(\"#'Factor List'!A1\",\"Back to Factor List\")","v":"Back to Factor List"}]
[]
[]
["Age",1,2,3,4,5,6,7,8,9,10,11,12,13,14,15,16,17,18,19,20]
[20,197,100.3,68.099999999999994,52,42.4,35.9,31.3,27.9,25.2,23.1,21.4,19.899999999999999,18.7,17.7,16.8,16,15.3,14.7,14.2,13.7]
[21,199.9,101.8,69.099999999999994,52.8,43,36.5,31.8,28.3,25.6,23.5,21.7,20.2,19,17.899999999999999,17,16.2,15.5,14.9,14.4,13.9]
[22,202.8,103.3,70.099999999999994,53.5,43.6,37,32.299999999999997,28.7,26,23.8,22,20.5,19.3,18.2,17.3,16.5,15.8,15.1,14.6,14.1]
[23,205.8,104.8,71.099999999999994,54.3,44.2,37.5,32.700000000000003,29.2,26.4,24.2,22.3,20.8,19.600000000000001,18.5,17.5,16.7,16,15.4,14.8,14.3]
[24,208.8,106.3,72.2,55.1,44.9,38.1,33.200000000000003,29.6,26.8,24.5,22.7,21.1,19.899999999999999,18.7,17.8,17,16.2,15.6,15,14.5]
[25,211.9,107.9,73.2,55.9,45.6,38.6,33.700000000000003,30,27.2,24.9,23,21.5,20.100000000000001,19,18.100000000000001,17.2,16.5,15.8,15.2,14.7]
[26,215,109.5,74.3,56.8,46.2,39.200000000000003,34.200000000000003,30.5,27.6,25.2,23.3,21.8,20.399999999999999,19.3,18.3,17.5,16.7,16.100000000000001,15.5,14.9]
[27,218.1,111.1,75.400000000000006,57.6,46.9,39.799999999999997,34.700000000000003,30.9,28,25.6,23.7,22.1,20.7,19.600000000000001,18.600000000000001,17.7,17,16.3,15.7,15.2]
[28,221.3,112.7,76.5,58.4,47.6,40.4,35.200000000000003,31.4,28.4,26,24,22.4,21,19.899999999999999,18.899999999999999,18,17.2,16.5,15.9,15.4]
[29,224.5,114.3,77.599999999999994,59.3,48.3,41,35.700000000000003,31.8,28.8,26.4,24.4,22.7,21.4,20.2,19.2,18.3,17.5,16.8,16.2,15.6]
[30,227.8,116,78.8,60.1,49,41.6,36.299999999999997,32.299999999999997,29.2,26.8,24.7,23.1,21.7,20.5,19.399999999999999,18.5,17.7,17,16.399999999999999,15.8]
[31,231.1,117.7,79.900000000000006,61,49.7,42.2,36.799999999999997,32.799999999999997,29.6,27.1,25.1,23.4,22,20.8,19.7,18.8,18,17.3,16.7,16.100000000000001]
[32,234.5,119.4,81.099999999999994,61.9,50.4,42.8,37.299999999999997,33.200000000000003,30.1,27.5,25.5,23.8,22.3,21.1,20,19.100000000000001,18.3,17.5,16.899999999999999,16.3]
[33,237.9,121.1,82.2,62.8,51.2,43.4,37.9,33.700000000000003,30.5,28,25.9,24.1,22.6,21.4,20.3,19.399999999999999,18.5,17.8,17.2,16.600000000000001]
[34,241.3,122.9,83.4,63.7,51.9,44,38.4,34.200000000000003,31,28.4,26.2,24.5,23,21.7,20.6,19.7,18.8,18.100000000000001,17.399999999999999,16.8]
[35,244.8,124.7,84.6,64.599999999999994,52.7,44.7,39,34.700000000000003,31.4,28.8,26.6,24.8,23.3,22,20.9,20,19.100000000000001,18.399999999999999,17.7,17.100000000000001]
[36,248.3,126.5,85.9,65.599999999999994,53.4,45.3,39.6,35.200000000000003,31.9,29.2,27,25.2,23.7,22.4,21.2,20.3,19.399999999999999,18.600000000000001,18,17.399999999999999]
[37,251.9,128.30000000000001,87.1,66.5,54.2,46,40.1,35.799999999999997,32.299999999999997,29.6,27.4,25.6,24,22.7,21.6,20.6,19.7,18.899999999999999,18.2,17.600000000000001]
[38,255.6,130.19999999999999,88.4,67.5,55,46.7,40.700000000000003,36.299999999999997,32.799999999999997,30.1,27.8,26,24.4,23,21.9,20.9,20,19.2,18.5,17.899999999999999]
[39,259.3,132,89.7,68.5,55.8,47.3,41.3,36.799999999999997,33.299999999999997,30.5,28.2,26.3,24.8,23.4,22.2,21.2,20.3,19.5,18.8,18.2]
[40,263,134,91,69.5,56.6,48,41.9,37.4,33.799999999999997,31,28.7,26.7,25.1,23.8,22.6,21.5,20.6,19.8,19.100000000000001,18.5]
[41,266.8,135.9,92.3,70.5,57.4,48.7,42.5,37.9,34.299999999999997,31.4,29.1,27.2,25.5,24.1,22.9,21.9,21,20.100000000000001,19.399999999999999,18.8]
[42,270.60000000000002,137.9,93.6,71.5,58.3,49.5,43.2,38.5,34.799999999999997,31.9,29.5,27.6,25.9,24.5,23.3,22.2,21.3,20.5,19.7,19.100000000000001]
[43,274.5,139.80000000000001,95,72.599999999999994,59.1,50.2,43.8,39.1,35.4,32.4,30,28,26.3,24.9,23.7,22.6,21.6,20.8,20.100000000000001,19.399999999999999]
[44,278.5,141.9,96.4,73.599999999999994,60,50.9,44.5,39.6,35.9,32.9,30.5,28.4,26.7,25.3,24,22.9,22,21.1,20.399999999999999,19.7]
[45,282.39999999999998,143.9,97.7,74.7,60.9,51.7,45.1,40.200000000000003,36.4,33.4,30.9,28.9,27.2,25.7,24.4,23.3,22.3,21.5,20.7,20.100000000000001]
[46,286.5,146,99.2,75.8,61.8,52.5,45.8,40.799999999999997,37,33.9,31.4,29.3,27.6,26.1,24.8,23.7,22.7,21.9,21.1,20.399999999999999]
[47,290.5,148.1,100.6,76.900000000000006,62.7,53.2,46.5,41.5,37.6,34.4,31.9,29.8,28,26.5,25.2,24.1,23.1,22.2,21.4,20.7]
[48,294.60000000000002,150.19999999999999,102,78,63.6,54,47.2,42.1,38.1,35,32.4,30.3,28.5,27,25.6,24.5,23.5,22.6,21.8]
[49,298.8,152.30000000000001,103.5,79.2,64.599999999999994,54.8,47.9,42.7,38.700000000000003,35.5,32.9,30.8,28.9,27.4,26.1,24.9,23.9,23]
[50,303,154.5,105,80.3,65.5,55.7,48.6,43.4,39.299999999999997,36.1,33.4,31.2,29.4,27.8,26.5,25.3,24.3]
[51,307.2,156.6,106.5,81.5,66.5,56.5,49.4,44,39.9,36.6,34,31.7,29.9,28.3,26.9,25.7]
[52,311.5,158.9,108,82.6,67.400000000000006,57.3,50.1,44.7,40.5,37.200000000000003,34.5,32.200000000000003,30.4,28.7,27.4]
[53,315.8,161.1,109.6,83.8,68.400000000000006,58.2,50.9,45.4,41.2,37.799999999999997,35,32.799999999999997,30.8,29.2]
[54,320.2,163.4,111.1,85.1,69.400000000000006,59,51.6,46.1,41.8,38.4,35.6,33.299999999999997,31.4]
[55,324.7,165.7,112.7,86.3,70.5,59.9,52.4,46.8,42.4,39,36.200000000000003,33.9]
[56,329.3,168.1,114.4,87.6,71.5,60.8,53.2,47.5,43.1,39.6,36.799999999999997]
[57,334,170.5,116,88.9,72.599999999999994,61.7,54,48.3,43.8,40.299999999999997]
[58,338.8,173,117.8,90.2,73.7,62.7,54.9,49,44.5]
[59,343.7,175.6,119.5,91.6,74.8,63.7,55.7,49.9]
[60,348.9,178.2,121.4,93,76,64.7,56.7]
[61,354.2,181,123.3,94.5,77.2,65.8]
[62,359.7,183.8,125.2,96,78.5]
[63,365.4,186.8,127.3,97.6]
[64,371.4,189.9,129.5]
[65,377.6,193.1]
[66,384]

{"sheet":"x-713","index":107,"n_rows":72,"n_cols":21,"rows_kept":72,"cut":false,"hidden":false,"merged":[]}
["Government Actuary's Department"]
[{"$f":"IF(title=\"> Enter workbook title here\",\"Enter workbook title in Cover sheet\",title)","v":"TPS (England & Wales) - Consolidated Factor Spreadsheet"}]
[{"$f":"TABLE_FACTOR_TYPE&\" - x-\"&TABLE_SERIES_NUMBER","v":"Added pension - x-713"}]
[]
[]
["Data Item","Factor Table Information"]
["Client","TPS_EW"]
["Section","Career Average"]
["Factor Type","Added pension"]
["Description","Personal and dependant's benefits, NPA 67. (Regular contribution elections made after 22 June 2010) Monthly contribution per £250 AP at date of election, £"]
["Gender","Unisex"]
["Factor Age/Period Definition","Age when notice of election given/ Payment period (in years)"]
["Section Number",0]
["Series Number",713]
["Table Reference","x-713"]
["Table Reference in Guidance","Table C67D"]
["Associated Guidance Note","Teachers' Pension Scheme: Final salary sections and career average section\nPurchase of additional pension and ceasing monthly contribution elections: Factors and guidance\nDate: 24 June 2019"]
["Date Factors Issued to Client","2023-10-17"]
["Date Factors Implemented (if known)"]
["Factor Status","Issued"]
[]
[null,{"$f":"HYPERLINK(\"#'Factor List'!A1\",\"Back to Factor List\")","v":"Back to Factor List"}]
[]
[]
["Age",1,2,3,4,5,6,7,8,9,10,11,12,13,14,15,16,17,18,19,20]
[20,215.1,109.5,74.3,56.8,46.2,39.200000000000003,34.200000000000003,30.5,27.6,25.2,23.3,21.8,20.399999999999999,19.3,18.3,17.5,16.7,16,15.5,14.9]
[21,218.3,111.1,75.400000000000006,57.6,46.9,39.799999999999997,34.700000000000003,30.9,28,25.6,23.7,22.1,20.7,19.600000000000001,18.600000000000001,17.7,17,16.3,15.7,15.1]
[22,221.5,112.8,76.599999999999994,58.5,47.6,40.4,35.200000000000003,31.4,28.4,26,24,22.4,21,19.899999999999999,18.899999999999999,18,17.2,16.5,15.9,15.4]
[23,224.7,114.4,77.7,59.3,48.3,41,35.799999999999997,31.8,28.8,26.4,24.4,22.7,21.4,20.2,19.100000000000001,18.3,17.5,16.8,16.2,15.6]
[24,228,116.1,78.8,60.2,49,41.6,36.299999999999997,32.299999999999997,29.2,26.8,24.8,23.1,21.7,20.5,19.399999999999999,18.5,17.7,17,16.399999999999999,15.8]
[25,231.4,117.8,80,61.1,49.7,42.2,36.799999999999997,32.799999999999997,29.7,27.2,25.1,23.4,22,20.8,19.7,18.8,18,17.3,16.600000000000001,16.100000000000001]
[26,234.8,119.5,81.2,62,50.5,42.8,37.4,33.299999999999997,30.1,27.6,25.5,23.8,22.3,21.1,20,19.100000000000001,18.3,17.5,16.899999999999999,16.3]
[27,238.2,121.3,82.3,62.9,51.2,43.4,37.9,33.799999999999997,30.5,28,25.9,24.1,22.7,21.4,20.3,19.399999999999999,18.5,17.8,17.100000000000001,16.5]
[28,241.7,123.1,83.5,63.8,52,44.1,38.5,34.299999999999997,31,28.4,26.2,24.5,23,21.7,20.6,19.600000000000001,18.8,18.100000000000001,17.399999999999999,16.8]
[29,245.2,124.9,84.8,64.7,52.7,44.7,39,34.799999999999997,31.4,28.8,26.6,24.8,23.3,22,20.9,19.899999999999999,19.100000000000001,18.3,17.7,17]
[30,248.8,126.7,86,65.7,53.5,45.4,39.6,35.299999999999997,31.9,29.2,27,25.2,23.7,22.4,21.2,20.2,19.399999999999999,18.600000000000001,17.899999999999999,17.3]
[31,252.4,128.5,87.2,66.599999999999994,54.3,46,40.200000000000003,35.799999999999997,32.4,29.6,27.4,25.6,24,22.7,21.5,20.5,19.7,18.899999999999999,18.2,17.600000000000001]
[32,256,130.4,88.5,67.599999999999994,55.1,46.7,40.799999999999997,36.299999999999997,32.799999999999997,30.1,27.8,25.9,24.4,23,21.9,20.8,19.899999999999999,19.2,18.5,17.8]
[33,259.7,132.30000000000001,89.8,68.599999999999994,55.9,47.4,41.4,36.799999999999997,33.299999999999997,30.5,28.2,26.3,24.7,23.4,22.2,21.1,20.2,19.399999999999999,18.7,18.100000000000001]
[34,263.5,134.19999999999999,91.1,69.599999999999994,56.7,48.1,42,37.4,33.799999999999997,31,28.6,26.7,25.1,23.7,22.5,21.5,20.5,19.7,19,18.399999999999999]
[35,267.2,136.1,92.4,70.599999999999994,57.5,48.8,42.6,37.9,34.299999999999997,31.4,29.1,27.1,25.5,24.1,22.8,21.8,20.9,20,19.3,18.7]
[36,271.10000000000002,138.1,93.7,71.599999999999994,58.3,49.5,43.2,38.5,34.799999999999997,31.9,29.5,27.5,25.8,24.4,23.2,22.1,21.2,20.3,19.600000000000001,18.899999999999999]
[37,275,140,95.1,72.599999999999994,59.2,50.2,43.8,39,35.299999999999997,32.299999999999997,29.9,27.9,26.2,24.8,23.5,22.4,21.5,20.7,19.899999999999999,19.2]
[38,278.89999999999998,142,96.4,73.7,60,50.9,44.4,39.6,35.799999999999997,32.799999999999997,30.4,28.3,26.6,25.1,23.9,22.8,21.8,21,20.2,19.5]
[39,282.89999999999998,144.1,97.8,74.7,60.9,51.7,45.1,40.200000000000003,36.299999999999997,33.299999999999997,30.8,28.7,27,25.5,24.2,23.1,22.2,21.3,20.5,19.8]
[40,286.89999999999998,146.1,99.2,75.8,61.8,52.4,45.7,40.700000000000003,36.9,33.799999999999997,31.3,29.2,27.4,25.9,24.6,23.5,22.5,21.6,20.8,20.2]
[41,291,148.19999999999999,100.6,76.900000000000006,62.6,53.2,46.4,41.3,37.4,34.299999999999997,31.7,29.6,27.8,26.3,25,23.9,22.9,22,21.2,20.5]
[42,295.10000000000002,150.30000000000001,102.1,78,63.5,53.9,47.1,42,38,34.799999999999997,32.200000000000003,30.1,28.3,26.7,25.4,24.2,23.2,22.3,21.5,20.8]
[43,299.3,152.5,103.5,79.099999999999994,64.5,54.7,47.8,42.6,38.5,35.299999999999997,32.700000000000003,30.5,28.7,27.1,25.8,24.6,23.6,22.7,21.9,21.2]
[44,303.5,154.6,105,80.2,65.400000000000006,55.5,48.5,43.2,39.1,35.9,33.200000000000003,31,29.1,27.6,26.2,25,24,23,22.2,21.5]
[45,307.7,156.80000000000001,106.5,81.400000000000006,66.3,56.3,49.2,43.8,39.700000000000003,36.4,33.700000000000003,31.5,29.6,28,26.6,25.4,24.3,23.4,22.6,21.9]
[46,312,159,108,82.5,67.3,57.1,49.9,44.5,40.299999999999997,36.9,34.200000000000003,32,30.1,28.4,27,25.8,24.7,23.8,23,22.2]
[47,316.3,161.19999999999999,109.5,83.7,68.3,58,50.6,45.2,40.9,37.5,34.700000000000003,32.5,30.5,28.9,27.5,26.2,25.1,24.2,23.3,22.6]
[48,320.7,163.5,111.1,84.9,69.2,58.8,51.4,45.8,41.5,38.1,35.299999999999997,33,31,29.3,27.9,26.7,25.6,24.6,23.7]
[49,325.10000000000002,165.7,112.6,86.1,70.2,59.7,52.1,46.5,42.1,38.700000000000003,35.799999999999997,33.5,31.5,29.8,28.3,27.1,26,25]
[50,329.5,168,114.2,87.3,71.2,60.5,52.9,47.2,42.8,39.200000000000003,36.4,34,32,30.3,28.8,27.5,26.4]
[51,334,170.3,115.8,88.6,72.3,61.4,53.7,47.9,43.4,39.799999999999997,36.9,34.5,32.5,30.7,29.3,28]
[52,338.5,172.6,117.4,89.8,73.3,62.3,54.4,48.6,44.1,40.4,37.5,35,33,31.2,29.7]
[53,343,175,119,91.1,74.3,63.2,55.2,49.3,44.7,41,38.1,35.6,33.5,31.7]
[54,347.6,177.3,120.6,92.3,75.400000000000006,64.099999999999994,56,50,45.4,41.7,38.6,36.1,34]
[55,352.3,179.8,122.3,93.6,76.400000000000006,65,56.9,50.8,46,42.3,39.200000000000003,36.700000000000003]
[56,357,182.2,124,94.9,77.5,65.900000000000006,57.7,51.5,46.7,42.9,39.9]
[57,361.8,184.7,125.7,96.3,78.599999999999994,66.900000000000006,58.5,52.3,47.4,43.6]
[58,366.8,187.3,127.5,97.7,79.8,67.900000000000006,59.4,53.1,48.2]
[59,371.9,189.9,129.30000000000001,99.1,80.900000000000006,68.900000000000006,60.3,53.9]
[60,377.1,192.6,131.19999999999999,100.5,82.1,69.900000000000006,61.3]
[61,382.5,195.4,133.1,102,83.4,71]
[62,388.1,198.3,135.1,103.6,84.7]
[63,393.9,201.3,137.19999999999999,105.2]
[64,400,204.5,139.4]
[65,406.2,207.7]
[66,412.7]

{"sheet":"x-714","index":108,"n_rows":73,"n_cols":21,"rows_kept":73,"cut":false,"hidden":false,"merged":[]}
["Government Actuary's Department"]
[{"$f":"IF(title=\"> Enter workbook title here\",\"Enter workbook title in Cover sheet\",title)","v":"TPS (England & Wales) - Consolidated Factor Spreadsheet"}]
[{"$f":"TABLE_FACTOR_TYPE&\" - x-\"&TABLE_SERIES_NUMBER","v":"Added pension - x-714"}]
[]
[]
["Data Item","Factor Table Information"]
["Client","TPS_EW"]
["Section","Career Average"]
["Factor Type","Added pension"]
["Description","Personal benefits, NPA 68. (Regular contribution elections made after 22 June 2010) Monthly contribution per £250 AP at date of election, £"]
["Gender","Unisex"]
["Factor Age/Period Definition","Age when notice of election given/ Payment period (in years)"]
["Section Number",0]
["Series Number",714]
["Table Reference","x-714"]
["Table Reference in Guidance","Table C68"]
["Associated Guidance Note","Teachers' Pension Scheme: Final salary sections and career average section\nPurchase of additional pension and ceasing monthly contribution elections: Factors and guidance\nDate: 24 June 2019"]
["Date Factors Issued to Client","2023-10-17"]
["Date Factors Implemented (if known)"]
["Factor Status","Issued"]
[]
[null,{"$f":"HYPERLINK(\"#'Factor List'!A1\",\"Back to Factor List\")","v":"Back to Factor List"}]
[]
[]
["Age",1,2,3,4,5,6,7,8,9,10,11,12,13,14,15,16,17,18,19,20]
[20,188.5,96,65.2,49.7,40.5,34.4,30,26.7,24.2,22.1,20.5,19.100000000000001,17.899999999999999,16.899999999999999,16.100000000000001,15.3,14.6,14.1,13.5,13.1]
[21,191.2,97.4,66.099999999999994,50.5,41.1,34.9,30.4,27.1,24.5,22.4,20.8,19.399999999999999,18.2,17.2,16.3,15.5,14.9,14.3,13.7,13.3]
[22,194,98.8,67.099999999999994,51.2,41.7,35.4,30.9,27.5,24.9,22.8,21.1,19.600000000000001,18.399999999999999,17.399999999999999,16.5,15.8,15.1,14.5,13.9,13.5]
[23,196.9,100.2,68.099999999999994,52,42.3,35.9,31.3,27.9,25.2,23.1,21.4,19.899999999999999,18.7,17.7,16.8,16,15.3,14.7,14.1,13.7]
[24,199.7,101.7,69,52.7,42.9,36.4,31.8,28.3,25.6,23.4,21.7,20.2,19,17.899999999999999,17,16.2,15.5,14.9,14.4,13.9]
[25,202.6,103.2,70,53.5,43.6,37,32.200000000000003,28.7,26,23.8,22,20.5,19.3,18.2,17.3,16.5,15.8,15.1,14.6,14.1]
[26,205.6,104.7,71.099999999999994,54.3,44.2,37.5,32.700000000000003,29.1,26.4,24.1,22.3,20.8,19.5,18.5,17.5,16.7,16,15.4,14.8,14.3]
[27,208.6,106.2,72.099999999999994,55.1,44.8,38,33.200000000000003,29.6,26.7,24.5,22.6,21.1,19.8,18.7,17.8,17,16.2,15.6,15,14.5]
[28,211.6,107.8,73.2,55.9,45.5,38.6,33.700000000000003,30,27.1,24.8,23,21.4,20.100000000000001,19,18,17.2,16.5,15.8,15.2,14.7]
[29,214.7,109.3,74.2,56.7,46.2,39.200000000000003,34.200000000000003,30.4,27.5,25.2,23.3,21.7,20.399999999999999,19.3,18.3,17.5,16.7,16,15.5,14.9]
[30,217.8,110.9,75.3,57.5,46.8,39.700000000000003,34.700000000000003,30.9,27.9,25.6,23.7,22.1,20.7,19.600000000000001,18.600000000000001,17.7,17,16.3,15.7,15.1]
[31,220.9,112.5,76.400000000000006,58.3,47.5,40.299999999999997,35.200000000000003,31.3,28.3,25.9,24,22.4,21,19.899999999999999,18.899999999999999,18,17.2,16.5,15.9,15.4]
[32,224.1,114.1,77.5,59.2,48.2,40.9,35.700000000000003,31.8,28.7,26.3,24.4,22.7,21.3,20.2,19.100000000000001,18.2,17.5,16.8,16.2,15.6]
[33,227.3,115.8,78.599999999999994,60,48.9,41.5,36.200000000000003,32.200000000000003,29.2,26.7,24.7,23,21.6,20.399999999999999,19.399999999999999,18.5,17.7,17,16.399999999999999,15.8]
[34,230.6,117.4,79.7,60.9,49.6,42.1,36.700000000000003,32.700000000000003,29.6,27.1,25.1,23.4,22,20.7,19.7,18.8,18,17.3,16.600000000000001,16.100000000000001]
[35,233.9,119.1,80.900000000000006,61.8,50.3,42.7,37.299999999999997,33.200000000000003,30,27.5,25.4,23.7,22.3,21.1,20,19.100000000000001,18.3,17.5,16.899999999999999,16.3]
[36,237.3,120.8,82,62.7,51,43.3,37.799999999999997,33.700000000000003,30.5,27.9,25.8,24.1,22.6,21.4,20.3,19.399999999999999,18.5,17.8,17.2,16.600000000000001]
[37,240.7,122.6,83.2,63.6,51.8,43.9,38.299999999999997,34.200000000000003,30.9,28.3,26.2,24.4,23,21.7,20.6,19.600000000000001,18.8,18.100000000000001,17.399999999999999,16.8]
[38,244.1,124.3,84.4,64.5,52.5,44.6,38.9,34.700000000000003,31.4,28.7,26.6,24.8,23.3,22,20.9,19.899999999999999,19.100000000000001,18.399999999999999,17.7,17.100000000000001]
[39,247.6,126.1,85.6,65.400000000000006,53.3,45.2,39.5,35.200000000000003,31.8,29.2,27,25.2,23.6,22.3,21.2,20.3,19.399999999999999,18.600000000000001,18,17.399999999999999]
[40,251.2,127.9,86.9,66.400000000000006,54.1,45.9,40,35.700000000000003,32.299999999999997,29.6,27.4,25.5,24,22.7,21.6,20.6,19.7,18.899999999999999,18.3,17.600000000000001]
[41,254.8,129.80000000000001,88.1,67.3,54.9,46.5,40.6,36.200000000000003,32.799999999999997,30,27.8,25.9,24.4,23,21.9,20.9,20,19.2,18.5,17.899999999999999]
[42,258.39999999999998,131.6,89.4,68.3,55.6,47.2,41.2,36.700000000000003,33.299999999999997,30.5,28.2,26.3,24.7,23.4,22.2,21.2,20.3,19.5,18.8,18.2]
[43,262.10000000000002,133.5,90.7,69.3,56.5,47.9,41.8,37.299999999999997,33.799999999999997,30.9,28.6,26.7,25.1,23.8,22.6,21.6,20.7,19.899999999999999,19.2,18.5]
[44,265.8,135.4,92,70.3,57.3,48.6,42.5,37.799999999999997,34.299999999999997,31.4,29.1,27.1,25.5,24.1,22.9,21.9,21,20.2,19.5,18.8]
[45,269.60000000000002,137.4,93.3,71.3,58.1,49.3,43.1,38.4,34.799999999999997,31.9,29.5,27.6,25.9,24.5,23.3,22.3,21.3,20.5,19.8,19.100000000000001]
[46,273.39999999999998,139.30000000000001,94.6,72.3,59,50.1,43.7,39,35.299999999999997,32.4,30,28,26.3,24.9,23.7,22.6,21.7,20.9,20.100000000000001,19.5]
[47,277.2,141.30000000000001,96,73.400000000000006,59.8,50.8,44.4,39.6,35.799999999999997,32.9,30.4,28.4,26.7,25.3,24.1,23,22,21.2,20.5,19.8]
[48,281.10000000000002,143.30000000000001,97.4,74.400000000000006,60.7,51.6,45,40.200000000000003,36.4,33.4,30.9,28.9,27.2,25.7,24.5,23.4,22.4,21.6,20.8,20.100000000000001]
[49,285,145.30000000000001,98.7,75.5,61.6,52.3,45.7,40.799999999999997,36.9,33.9,31.4,29.3,27.6,26.1,24.9,23.7,22.8,21.9,21.2]
[50,288.89999999999998,147.30000000000001,100.1,76.599999999999994,62.5,53.1,46.4,41.4,37.5,34.4,31.9,29.8,28,26.5,25.3,24.1,23.1,22.3]
[51,292.89999999999998,149.4,101.5,77.7,63.4,53.9,47.1,42,38.1,34.9,32.4,30.3,28.5,27,25.7,24.5,23.5]
[52,296.89999999999998,151.4,103,78.8,64.3,54.6,47.8,42.6,38.6,35.5,32.9,30.7,28.9,27.4,26.1,24.9]
[53,301,153.5,104.4,79.900000000000006,65.2,55.4,48.5,43.3,39.200000000000003,36,33.4,31.2,29.4,27.8,26.5]
[54,305.10000000000002,155.69999999999999,105.9,81,66.099999999999994,56.2,49.2,43.9,39.799999999999997,36.6,33.9,31.7,29.9,28.3]
[55,309.3,157.80000000000001,107.4,82.2,67.099999999999994,57.1,49.9,44.6,40.4,37.1,34.4,32.200000000000003,30.4]
[56,313.5,160,108.9,83.4,68.099999999999994,57.9,50.7,45.2,41,37.700000000000003,35,32.799999999999997]
[57,317.89999999999998,162.30000000000001,110.5,84.6,69.099999999999994,58.8,51.4,45.9,41.7,38.299999999999997,35.6]
[58,322.3,164.6,112.1,85.8,70.099999999999994,59.7,52.2,46.6,42.3,38.9]
[59,327,167,113.7,87.1,71.2,60.6,53,47.4,43.1]
[60,331.7,169.4,115.4,88.4,72.3,61.5,53.9,48.2]
[61,336.6,172,117.2,89.8,73.400000000000006,62.5,54.8]
[62,341.7,174.6,119,91.2,74.599999999999994,63.6]
[63,347,177.4,120.9,92.7,75.8]
[64,352.6,180.2,122.9,94.3]
[65,358.4,183.2,125]
[66,364.4,186.4]
[67,370.7]

{"sheet":"x-715","index":109,"n_rows":73,"n_cols":21,"rows_kept":73,"cut":false,"hidden":false,"merged":[]}
["Government Actuary's Department"]
[{"$f":"IF(title=\"> Enter workbook title here\",\"Enter workbook title in Cover sheet\",title)","v":"TPS (England & Wales) - Consolidated Factor Spreadsheet"}]
[{"$f":"TABLE_FACTOR_TYPE&\" - x-\"&TABLE_SERIES_NUMBER","v":"Added pension - x-715"}]
[]
[]
["Data Item","Factor Table Information"]
["Client","TPS_EW"]
["Section","Career Average"]
["Factor Type","Added pension"]
["Description","Personal and dependant's benefits, NPA 68. (Regular contribution elections made after 22 June 2010) Monthly contribution per £250 AP at date of election, £"]
["Gender","Unisex"]
["Factor Age/Period Definition","Age when notice of election given/ Payment period (in years)"]
["Section Number",0]
["Series Number",715]
["Table Reference","x-715"]
["Table Reference in Guidance","Table C68D"]
["Associated Guidance Note","Teachers' Pension Scheme: Final salary sections and career average section\nPurchase of additional pension and ceasing monthly contribution elections: Factors and guidance\nDate: 24 June 2019"]
["Date Factors Issued to Client","2023-10-17"]
["Date Factors Implemented (if known)"]
["Factor Status","Issued"]
[]
[null,{"$f":"HYPERLINK(\"#'Factor List'!A1\",\"Back to Factor List\")","v":"Back to Factor List"}]
[]
[]
["Age",1,2,3,4,5,6,7,8,9,10,11,12,13,14,15,16,17,18,19,20]
[20,206.6,105.2,71.400000000000006,54.5,44.4,37.700000000000003,32.9,29.3,26.5,24.2,22.4,20.9,19.600000000000001,18.5,17.600000000000001,16.8,16.100000000000001,15.4,14.8,14.3]
[21,209.6,106.7,72.5,55.3,45.1,38.200000000000003,33.4,29.7,26.9,24.6,22.8,21.2,19.899999999999999,18.8,17.899999999999999,17,16.3,15.6,15.1,14.5]
[22,212.7,108.3,73.5,56.1,45.7,38.799999999999997,33.799999999999997,30.1,27.3,25,23.1,21.5,20.2,19.100000000000001,18.100000000000001,17.3,16.5,15.9,15.3,14.8]
[23,215.8,109.9,74.599999999999994,57,46.4,39.4,34.299999999999997,30.6,27.7,25.3,23.4,21.8,20.5,19.399999999999999,18.399999999999999,17.5,16.8,16.100000000000001,15.5,15]
[24,219,111.5,75.7,57.8,47.1,39.9,34.799999999999997,31,28.1,25.7,23.8,22.2,20.8,19.7,18.7,17.8,17,16.3,15.7,15.2]
[25,222.2,113.1,76.8,58.6,47.8,40.5,35.4,31.5,28.5,26.1,24.1,22.5,21.1,19.899999999999999,18.899999999999999,18.100000000000001,17.3,16.600000000000001,16,15.4]
[26,225.4,114.8,77.900000000000006,59.5,48.5,41.1,35.9,31.9,28.9,26.5,24.5,22.8,21.4,20.2,19.2,18.3,17.5,16.8,16.2,15.7]
[27,228.7,116.5,79.099999999999994,60.4,49.2,41.7,36.4,32.4,29.3,26.8,24.8,23.2,21.7,20.5,19.5,18.600000000000001,17.8,17.100000000000001,16.5,15.9]
[28,232,118.1,80.2,61.2,49.9,42.3,36.9,32.9,29.7,27.2,25.2,23.5,22.1,20.8,19.8,18.899999999999999,18.100000000000001,17.3,16.7,16.100000000000001]
[29,235.4,119.9,81.400000000000006,62.1,50.6,42.9,37.5,33.4,30.2,27.6,25.6,23.8,22.4,21.1,20.100000000000001,19.100000000000001,18.3,17.600000000000001,16.899999999999999,16.399999999999999]
[30,238.8,121.6,82.5,63,51.3,43.6,38,33.799999999999997,30.6,28,25.9,24.2,22.7,21.5,20.399999999999999,19.399999999999999,18.600000000000001,17.899999999999999,17.2,16.600000000000001]
[31,242.2,123.3,83.7,63.9,52.1,44.2,38.6,34.299999999999997,31.1,28.5,26.3,24.5,23,21.8,20.7,19.7,18.899999999999999,18.100000000000001,17.5,16.899999999999999]
[32,245.7,125.1,84.9,64.900000000000006,52.8,44.8,39.1,34.799999999999997,31.5,28.9,26.7,24.9,23.4,22.1,21,20,19.100000000000001,18.399999999999999,17.7,17.100000000000001]
[33,249.2,126.9,86.2,65.8,53.6,45.5,39.700000000000003,35.299999999999997,32,29.3,27.1,25.3,23.7,22.4,21.3,20.3,19.399999999999999,18.7,18,17.399999999999999]
[34,252.8,128.69999999999999,87.4,66.8,54.4,46.1,40.299999999999997,35.9,32.4,29.7,27.5,25.6,24.1,22.7,21.6,20.6,19.7,18.899999999999999,18.2,17.600000000000001]
[35,256.39999999999998,130.6,88.7,67.7,55.2,46.8,40.799999999999997,36.4,32.9,30.1,27.9,26,24.4,23.1,21.9,20.9,20,19.2,18.5,17.899999999999999]
[36,260.10000000000002,132.4,89.9,68.7,55.9,47.5,41.4,36.9,33.4,30.6,28.3,26.4,24.8,23.4,22.2,21.2,20.3,19.5,18.8,18.2]
[37,263.8,134.30000000000001,91.2,69.7,56.7,48.1,42,37.4,33.9,31,28.7,26.8,25.2,23.8,22.6,21.5,20.6,19.8,19.100000000000001,18.399999999999999]
[38,267.5,136.19999999999999,92.5,70.7,57.6,48.8,42.6,38,34.4,31.5,29.1,27.2,25.5,24.1,22.9,21.9,20.9,20.100000000000001,19.399999999999999,18.7]
[39,271.3,138.19999999999999,93.8,71.7,58.4,49.5,43.2,38.5,34.9,31.9,29.5,27.6,25.9,24.5,23.3,22.2,21.2,20.399999999999999,19.7,19]
[40,275.10000000000002,140.1,95.1,72.7,59.2,50.2,43.9,39.1,35.4,32.4,30,28,26.3,24.8,23.6,22.5,21.6,20.7,20,19.3]
[41,279,142.1,96.5,73.7,60.1,51,44.5,39.6,35.9,32.9,30.4,28.4,26.7,25.2,24,22.9,21.9,21.1,20.3,19.600000000000001]
[42,282.89999999999998,144.1,97.9,74.8,60.9,51.7,45.1,40.200000000000003,36.4,33.4,30.9,28.8,27.1,25.6,24.3,23.2,22.3,21.4,20.6,20]
[43,286.89999999999998,146.1,99.3,75.8,61.8,52.5,45.8,40.799999999999997,36.9,33.9,31.3,29.3,27.5,26,24.7,23.6,22.6,21.7,21,20.3]
[44,290.89999999999998,148.19999999999999,100.7,76.900000000000006,62.7,53.2,46.5,41.4,37.5,34.4,31.8,29.7,27.9,26.4,25.1,24,23,22.1,21.3,20.6]
[45,294.89999999999998,150.30000000000001,102.1,78,63.6,54,47.1,42,38,34.9,32.299999999999997,30.2,28.4,26.8,25.5,24.3,23.3,22.4,21.7,20.9]
[46,299,152.30000000000001,103.5,79.099999999999994,64.5,54.7,47.8,42.6,38.6,35.4,32.799999999999997,30.6,28.8,27.2,25.9,24.7,23.7,22.8,22,21.3]
[47,303.10000000000002,154.4,104.9,80.2,65.400000000000006,55.5,48.5,43.3,39.200000000000003,35.9,33.299999999999997,31.1,29.2,27.7,26.3,25.1,24.1,23.2,22.4,21.6]
[48,307.2,156.6,106.4,81.3,66.3,56.3,49.2,43.9,39.799999999999997,36.5,33.799999999999997,31.6,29.7,28.1,26.7,25.5,24.5,23.6,22.7,22]
[49,311.3,158.69999999999999,107.9,82.5,67.3,57.1,49.9,44.5,40.4,37,34.299999999999997,32.1,30.2,28.5,27.1,25.9,24.9,23.9,23.1]
[50,315.5,160.9,109.3,83.6,68.2,58,50.6,45.2,40.9,37.6,34.799999999999997,32.5,30.6,29,27.6,26.3,25.3,24.3]
[51,319.7,163,110.8,84.8,69.2,58.8,51.4,45.8,41.5,38.1,35.299999999999997,33,31.1,29.4,28,26.8,25.7]
[52,323.89999999999998,165.2,112.3,85.9,70.099999999999994,59.6,52.1,46.5,42.2,38.700000000000003,35.9,33.5,31.6,29.9,28.4,27.2]
[53,328.2,167.4,113.9,87.1,71.099999999999994,60.4,52.8,47.2,42.8,39.299999999999997,36.4,34,32,30.4,28.9]
[54,332.5,169.6,115.4,88.3,72.099999999999994,61.3,53.6,47.9,43.4,39.799999999999997,37,34.6,32.5,30.8]
[55,336.8,171.9,116.9,89.5,73.099999999999994,62.2,54.4,48.5,44,40.4,37.5,35.1,33.1]
[56,341.2,174.2,118.5,90.7,74.099999999999994,63,55.1,49.2,44.7,41,38.1,35.6]
[57,345.7,176.5,120.1,92,75.099999999999994,63.9,55.9,50,45.3,41.6,38.700000000000003]
[58,350.3,178.9,121.8,93.3,76.2,64.8,56.7,50.7,46,42.3]
[59,355.1,181.3,123.5,94.6,77.3,65.8,57.6,51.5,46.7]
[60,359.9,183.9,125.2,95.9,78.400000000000006,66.7,58.4,52.3]
[61,364.9,186.5,127,97.3,79.599999999999994,67.7,59.4]
[62,370.1,189.1,128.9,98.8,80.7,68.8]
[63,375.5,191.9,130.80000000000001,100.3,82]
[64,381.1,194.8,132.80000000000001,101.9]
[65,387,197.9,134.9]
[66,393,201]
[67,399.3]

{"sheet":"x-716","index":110,"n_rows":64,"n_cols":21,"rows_kept":64,"cut":false,"hidden":false,"merged":[]}
["Government Actuary's Department"]
[{"$f":"IF(title=\"> Enter workbook title here\",\"Enter workbook title in Cover sheet\",title)","v":"TPS (England & Wales) - Consolidated Factor Spreadsheet"}]
[{"$f":"TABLE_FACTOR_TYPE&\" - x-\"&TABLE_SERIES_NUMBER","v":"Added pension - x-716"}]
[]
[]
["Data Item","Factor Table Information"]
["Client","TPS_EW"]
["Section","Final Salary"]
["Factor Type","Added pension"]
["Description","Personal benefits, NPA 60. (Regular contribution elections made on or before 22 June 2010) Monthly contribution per £250 AP at date of election, £"]
["Gender","Unisex"]
["Factor Age/Period Definition","Age when notice of election given/ Payment period (in years)"]
["Section Number",1]
["Series Number",716]
["Table Reference","x-716"]
["Table Reference in Guidance","Table R60"]
["Associated Guidance Note","Teachers' Pension Scheme: Final salary sections and career average section\nPurchase of additional pension and ceasing monthly contribution elections: Factors and guidance\nDate: 24 June 2019"]
["Date Factors Issued to Client","2023-10-17"]
["Date Factors Implemented (if known)"]
["Factor Status","Issued"]
[]
[null,{"$f":"HYPERLINK(\"#'Factor List'!A1\",\"Back to Factor List\")","v":"Back to Factor List"}]
[]
[]
["Age",1,2,3,4,5,6,7,8,9,10,11,12,13,14,15,16,17,18,19,20]
[20,287.8,146.5,99.5,76,61.9,52.5,45.8,40.799999999999997,36.9,33.799999999999997,31.2,29.1,27.3,25.8,24.5,23.4,22.4,21.5,20.7,20]
[21,291.8,148.6,100.9,77,62.7,53.2,46.4,41.3,37.4,34.200000000000003,31.7,29.5,27.7,26.2,24.9,23.7,22.7,21.8,21,20.2]
[22,295.89999999999998,150.69999999999999,102.3,78.099999999999994,63.6,54,47.1,41.9,37.9,34.700000000000003,32.1,30,28.1,26.6,25.2,24,23,22.1,21.3,20.5]
[23,300.10000000000002,152.80000000000001,103.7,79.2,64.5,54.7,47.7,42.5,38.5,35.200000000000003,32.6,30.4,28.5,26.9,25.6,24.4,23.3,22.4,21.6,20.8]
[24,304.3,155,105.2,80.3,65.400000000000006,55.5,48.4,43.1,39,35.700000000000003,33,30.8,28.9,27.3,25.9,24.7,23.7,22.7,21.9,21.1]
[25,308.60000000000002,157.1,106.7,81.5,66.3,56.3,49.1,43.7,39.6,36.200000000000003,33.5,31.2,29.3,27.7,26.3,25.1,24,23,22.2,21.4]
[26,312.89999999999998,159.30000000000001,108.2,82.6,67.3,57.1,49.8,44.3,40.1,36.700000000000003,34,31.7,29.8,28.1,26.7,25.4,24.3,23.4,22.5,21.7]
[27,317.3,161.6,109.7,83.8,68.2,57.9,50.5,45,40.700000000000003,37.299999999999997,34.5,32.1,30.2,28.5,27.1,25.8,24.7,23.7,22.8,22]
[28,321.8,163.80000000000001,111.2,84.9,69.2,58.7,51.2,45.6,41.3,37.799999999999997,34.9,32.6,30.6,28.9,27.4,26.2,25,24,23.2,22.4]
[29,326.3,166.1,112.8,86.1,70.2,59.5,51.9,46.2,41.8,38.299999999999997,35.4,33.1,31,29.3,27.8,26.5,25.4,24.4,23.5,22.7]
[30,330.8,168.5,114.4,87.3,71.099999999999994,60.4,52.7,46.9,42.4,38.9,35.9,33.5,31.5,29.7,28.2,26.9,25.8,24.7,23.8,23]
[31,335.5,170.8,116,88.6,72.099999999999994,61.2,53.4,47.6,43,39.4,36.5,34,31.9,30.2,28.6,27.3,26.1,25.1,24.2,23.3]
[32,340.2,173.2,117.6,89.8,73.2,62.1,54.2,48.2,43.6,40,37,34.5,32.4,30.6,29,27.7,26.5,25.5,24.5,23.7]
[33,344.9,175.7,119.3,91.1,74.2,62.9,54.9,48.9,44.3,40.5,37.5,35,32.799999999999997,31,29.5,28.1,26.9,25.8,24.9,24]
[34,349.8,178.1,120.9,92.4,75.2,63.8,55.7,49.6,44.9,41.1,38,35.5,33.299999999999997,31.5,29.9,28.5,27.3,26.2,25.2,24.4]
[35,354.6,180.6,122.6,93.7,76.3,64.7,56.5,50.3,45.5,41.7,38.6,36,33.799999999999997,31.9,30.3,28.9,27.7,26.6,25.6,24.8]
[36,359.6,183.1,124.3,95,77.400000000000006,65.599999999999994,57.3,51,46.2,42.3,39.1,36.5,34.299999999999997,32.4,30.8,29.3,28.1,27,26,25.1]
[37,364.6,185.7,126.1,96.3,78.5,66.599999999999994,58.1,51.7,46.8,42.9,39.700000000000003,37,34.799999999999997,32.9,31.2,29.8,28.5,27.4,26.4,25.5]
[38,369.8,188.3,127.9,97.7,79.599999999999994,67.5,58.9,52.5,47.5,43.5,40.299999999999997,37.6,35.299999999999997,33.299999999999997,31.7,30.2,28.9,27.8,26.8,25.9]
[39,374.9,191,129.69999999999999,99,80.7,68.5,59.8,53.2,48.2,44.1,40.799999999999997,38.1,35.799999999999997,33.799999999999997,32.1,30.7,29.4,28.2,27.2,26.3]
[40,380.2,193.6,131.5,100.4,81.8,69.400000000000006,60.6,54,48.9,44.8,41.4,38.700000000000003,36.299999999999997,34.299999999999997,32.6,31.1,29.8,28.7,27.6]
[41,385.5,196.4,133.30000000000001,101.9,83,70.400000000000006,61.5,54.8,49.6,45.4,42.1,39.200000000000003,36.9,34.9,33.1,31.6,30.3,29.1]
[42,390.9,199.1,135.19999999999999,103.3,84.2,71.5,62.4,55.6,50.3,46.1,42.7,39.799999999999997,37.4,35.4,33.6,32.1,30.8]
[43,396.5,202,137.19999999999999,104.8,85.4,72.5,63.3,56.4,51.1,46.8,43.3,40.4,38,35.9,34.200000000000003,32.6]
[44,402,204.8,139.1,106.3,86.6,73.5,64.2,57.2,51.8,47.5,44,41.1,38.6,36.5,34.700000000000003]
[45,407.7,207.7,141.1,107.8,87.9,74.599999999999994,65.2,58.1,52.6,48.2,44.7,41.7,39.200000000000003,37.1]
[46,413.5,210.7,143.1,109.4,89.2,75.7,66.099999999999994,59,53.4,49,45.3,42.3,39.799999999999997]
[47,419.3,213.7,145.19999999999999,111,90.5,76.8,67.099999999999994,59.8,54.2,49.7,46.1,43]
[48,425.3,216.7,147.30000000000001,112.6,91.8,78,68.099999999999994,60.8,55,50.5,46.8]
[49,431.3,219.9,149.4,114.3,93.2,79.2,69.2,61.7,55.9,51.3]
[50,437.5,223,151.6,115.9,94.6,80.400000000000006,70.2,62.6,56.8]
[51,443.7,226.2,153.80000000000001,117.7,96,81.599999999999994,71.3,63.6]
[52,450,229.5,156.1,119.4,97.4,82.8,72.400000000000006]
[53,456.5,232.9,158.4,121.2,98.9,84.1]
[54,461,235.2,160,122.5,100]
[55,463.1,236.3,160.80000000000001,123.1]
[56,465.1,237.4,161.6]
[57,467.7,238.8]
[58,470]

{"sheet":"x-717","index":111,"n_rows":64,"n_cols":21,"rows_kept":64,"cut":false,"hidden":false,"merged":[]}
["Government Actuary's Department"]
[{"$f":"IF(title=\"> Enter workbook title here\",\"Enter workbook title in Cover sheet\",title)","v":"TPS (England & Wales) - Consolidated Factor Spreadsheet"}]
[{"$f":"TABLE_FACTOR_TYPE&\" - x-\"&TABLE_SERIES_NUMBER","v":"Added pension - x-717"}]
[]
[]
["Data Item","Factor Table Information"]
["Client","TPS_EW"]
["Section","Final Salary"]
["Factor Type","Added pension"]
["Description","Personal and dependant's benefits, NPA 60. (Regular contribution elections made on or before 22 June 2010) Monthly contribution per £250 AP at date of election, £"]
["Gender","Unisex"]
["Factor Age/Period Definition","Age when notice of election given/ Payment period (in years)"]
["Section Number",1]
["Series Number",717]
["Table Reference","x-717"]
["Table Reference in Guidance","Table R60D"]
["Associated Guidance Note","Teachers' Pension Scheme: Final salary sections and career average section\nPurchase of additional pension and ceasing monthly contribution elections: Factors and guidance\nDate: 24 June 2019"]
["Date Factors Issued to Client","2023-10-17"]
["Date Factors Implemented (if known)"]
["Factor Status","Issued"]
[]
[null,{"$f":"HYPERLINK(\"#'Factor List'!A1\",\"Back to Factor List\")","v":"Back to Factor List"}]
[]
[]
["Age",1,2,3,4,5,6,7,8,9,10,11,12,13,14,15,16,17,18,19,20]
[20,307.3,156.5,106.2,81.099999999999994,66.099999999999994,56,48.9,43.5,39.4,36.1,33.299999999999997,31.1,29.2,27.6,26.2,24.9,23.9,22.9,22.1,21.3]
[21,311.60000000000002,158.69999999999999,107.7,82.3,67,56.8,49.6,44.1,39.9,36.6,33.799999999999997,31.5,29.6,28,26.5,25.3,24.2,23.3,22.4,21.6]
[22,316,160.9,109.2,83.4,67.900000000000006,57.6,50.3,44.8,40.5,37.1,34.299999999999997,32,30,28.4,26.9,25.7,24.6,23.6,22.7,21.9]
[23,320.5,163.19999999999999,110.8,84.6,68.900000000000006,58.4,51,45.4,41.1,37.6,34.799999999999997,32.4,30.5,28.8,27.3,26,24.9,23.9,23,22.2]
[24,325,165.5,112.3,85.8,69.900000000000006,59.3,51.7,46,41.7,38.1,35.299999999999997,32.9,30.9,29.2,27.7,26.4,25.3,24.3,23.4,22.6]
[25,329.6,167.8,113.9,87,70.900000000000006,60.1,52.4,46.7,42.2,38.700000000000003,35.799999999999997,33.4,31.3,29.6,28.1,26.8,25.6,24.6,23.7,22.9]
[26,334.2,170.2,115.5,88.2,71.900000000000006,61,53.2,47.4,42.8,39.200000000000003,36.299999999999997,33.799999999999997,31.8,30,28.5,27.2,26,25,24,23.2]
[27,338.9,172.6,117.2,89.5,72.900000000000006,61.8,53.9,48,43.4,39.799999999999997,36.799999999999997,34.299999999999997,32.200000000000003,30.4,28.9,27.5,26.4,25.3,24.4,23.5]
[28,343.7,175,118.8,90.7,73.900000000000006,62.7,54.7,48.7,44.1,40.4,37.299999999999997,34.799999999999997,32.700000000000003,30.9,29.3,27.9,26.7,25.7,24.7,23.9]
[29,348.5,177.5,120.5,92,74.900000000000006,63.6,55.5,49.4,44.7,40.9,37.9,35.299999999999997,33.1,31.3,29.7,28.3,27.1,26,25.1,24.2]
[30,353.4,179.9,122.2,93.3,76,64.5,56.2,50.1,45.3,41.5,38.4,35.799999999999997,33.6,31.8,30.1,28.7,27.5,26.4,25.4,24.6]
[31,358.3,182.5,123.9,94.6,77.099999999999994,65.400000000000006,57,50.8,46,42.1,38.9,36.299999999999997,34.1,32.200000000000003,30.6,29.2,27.9,26.8,25.8,24.9]
[32,363.3,185,125.6,95.9,78.099999999999994,66.3,57.8,51.5,46.6,42.7,39.5,36.799999999999997,34.6,32.700000000000003,31,29.6,28.3,27.2,26.2,25.3]
[33,368.4,187.6,127.4,97.3,79.2,67.2,58.7,52.2,47.3,43.3,40,37.299999999999997,35.1,33.1,31.5,30,28.7,27.6,26.6,25.7]
[34,373.5,190.2,129.1,98.6,80.3,68.2,59.5,53,47.9,43.9,40.6,37.9,35.6,33.6,31.9,30.4,29.1,28,27,26]
[35,378.7,192.9,130.9,100,81.5,69.099999999999994,60.3,53.7,48.6,44.5,41.2,38.4,36.1,34.1,32.4,30.9,29.6,28.4,27.4,26.4]
[36,384,195.5,132.80000000000001,101.4,82.6,70.099999999999994,61.2,54.5,49.3,45.1,41.8,39,36.6,34.6,32.799999999999997,31.3,30,28.8,27.8,26.8]
[37,389.3,198.3,134.6,102.8,83.8,71.099999999999994,62,55.2,50,45.8,42.4,39.5,37.1,35.1,33.299999999999997,31.8,30.4,29.2,28.2,27.2]
[38,394.7,201,136.5,104.3,84.9,72.099999999999994,62.9,56,50.7,46.4,43,40.1,37.700000000000003,35.6,33.799999999999997,32.200000000000003,30.9,29.7,28.6,27.6]
[39,400.2,203.8,138.4,105.7,86.1,73.099999999999994,63.8,56.8,51.4,47.1,43.6,40.700000000000003,38.200000000000003,36.1,34.299999999999997,32.700000000000003,31.3,30.1,29,28.1]
[40,405.7,206.7,140.30000000000001,107.2,87.3,74.099999999999994,64.7,57.6,52.2,47.8,44.2,41.3,38.799999999999997,36.6,34.799999999999997,33.200000000000003,31.8,30.6,29.5]
[41,411.4,209.5,142.30000000000001,108.7,88.6,75.2,65.599999999999994,58.5,52.9,48.5,44.9,41.9,39.299999999999997,37.200000000000003,35.299999999999997,33.700000000000003,32.299999999999997,31.1]
[42,417.1,212.4,144.30000000000001,110.2,89.8,76.2,66.5,59.3,53.7,49.2,45.5,42.5,39.9,37.799999999999997,35.9,34.200000000000003,32.799999999999997]
[43,422.9,215.4,146.30000000000001,111.8,91.1,77.3,67.5,60.2,54.5,49.9,46.2,43.1,40.5,38.299999999999997,36.4,34.799999999999997]
[44,428.7,218.4,148.4,113.4,92.4,78.400000000000006,68.5,61,55.3,50.7,46.9,43.8,41.2,38.9,37]
[45,434.7,221.5,150.4,115,93.7,79.599999999999994,69.5,61.9,56.1,51.4,47.6,44.5,41.8,39.5]
[46,440.7,224.5,152.5,116.6,95,80.7,70.5,62.8,56.9,52.2,48.3,45.1,42.4]
[47,446.8,227.7,154.69999999999999,118.3,96.4,81.900000000000006,71.5,63.8,57.8,53,49.1,45.8]
[48,453,230.9,156.9,119.9,97.8,83.1,72.599999999999994,64.7,58.6,53.8,49.8]
[49,459.3,234.1,159.1,121.7,99.2,84.3,73.7,65.7,59.5,54.6]
[50,465.7,237.4,161.4,123.4,100.7,85.5,74.8,66.7,60.4]
[51,472.1,240.7,163.69999999999999,125.2,102.1,86.8,75.900000000000006,67.7]
[52,478.7,244.1,166,127,103.6,88.1,77]
[53,485.4,247.6,168.4,128.9,105.2,89.4]
[54,490,250,170.1,130.1,106.2]
[55,491.8,251,170.8,130.69999999999999]
[56,493.7,252,171.5]
[57,496.1,253.3]
[58,498.2]

{"sheet":"x-718","index":112,"n_rows":69,"n_cols":21,"rows_kept":69,"cut":false,"hidden":false,"merged":[]}
["Government Actuary's Department"]
[{"$f":"IF(title=\"> Enter workbook title here\",\"Enter workbook title in Cover sheet\",title)","v":"TPS (England & Wales) - Consolidated Factor Spreadsheet"}]
[{"$f":"TABLE_FACTOR_TYPE&\" - x-\"&TABLE_SERIES_NUMBER","v":"Added pension - x-718"}]
[]
[]
["Data Item","Factor Table Information"]
["Client","TPS_EW"]
["Section","Final Salary"]
["Factor Type","Added pension"]
["Description","Personal benefits, NPA 65. (Regular contribution elections made on or before 22 June 2010) Monthly contribution per £250 AP at date of election, £"]
["Gender","Unisex"]
["Factor Age/Period Definition","Age when notice of election given/ Payment period (in years)"]
["Section Number",1]
["Series Number",718]
["Table Reference","x-718"]
["Table Reference in Guidance","Table R65"]
["Associated Guidance Note","Teachers' Pension Scheme: Final salary sections and career average section\nPurchase of additional pension and ceasing monthly contribution elections: Factors and guidance\nDate: 24 June 2019"]
["Date Factors Issued to Client","2023-10-17"]
["Date Factors Implemented (if known)"]
["Factor Status","Issued"]
[]
[null,{"$f":"HYPERLINK(\"#'Factor List'!A1\",\"Back to Factor List\")","v":"Back to Factor List"}]
[]
[]
["Age",1,2,3,4,5,6,7,8,9,10,11,12,13,14,15,16,17,18,19,20]
[20,235.2,119.8,81.3,62.1,50.6,42.9,37.4,33.299999999999997,30.1,27.6,25.5,23.8,22.3,21.1,20,19.100000000000001,18.3,17.5,16.899999999999999,16.3]
[21,238.5,121.4,82.4,62.9,51.3,43.5,37.9,33.799999999999997,30.6,28,25.9,24.1,22.7,21.4,20.3,19.399999999999999,18.5,17.8,17.100000000000001,16.5]
[22,241.7,123.1,83.6,63.8,52,44.1,38.5,34.200000000000003,31,28.4,26.2,24.5,23,21.7,20.6,19.600000000000001,18.8,18,17.399999999999999,16.8]
[23,245.1,124.8,84.7,64.7,52.7,44.7,39,34.700000000000003,31.4,28.8,26.6,24.8,23.3,22,20.9,19.899999999999999,19,18.3,17.600000000000001,17]
[24,248.4,126.5,85.9,65.599999999999994,53.4,45.3,39.5,35.200000000000003,31.8,29.2,27,25.1,23.6,22.3,21.2,20.2,19.3,18.5,17.899999999999999,17.2]
[25,251.8,128.19999999999999,87.1,66.5,54.1,45.9,40.1,35.700000000000003,32.299999999999997,29.6,27.3,25.5,23.9,22.6,21.5,20.5,19.600000000000001,18.8,18.100000000000001,17.5]
[26,255.3,130,88.2,67.400000000000006,54.9,46.6,40.6,36.200000000000003,32.700000000000003,30,27.7,25.8,24.3,22.9,21.8,20.7,19.899999999999999,19.100000000000001,18.399999999999999,17.7]
[27,258.8,131.80000000000001,89.5,68.3,55.6,47.2,41.2,36.700000000000003,33.200000000000003,30.4,28.1,26.2,24.6,23.2,22.1,21,20.100000000000001,19.3,18.600000000000001,18]
[28,262.3,133.6,90.7,69.2,56.4,47.8,41.7,37.200000000000003,33.6,30.8,28.5,26.6,24.9,23.6,22.4,21.3,20.399999999999999,19.600000000000001,18.899999999999999,18.2]
[29,265.89999999999998,135.4,91.9,70.2,57.2,48.5,42.3,37.700000000000003,34.1,31.2,28.9,26.9,25.3,23.9,22.7,21.6,20.7,19.899999999999999,19.100000000000001,18.5]
[30,269.5,137.19999999999999,93.2,71.2,58,49.2,42.9,38.200000000000003,34.6,31.7,29.3,27.3,25.6,24.2,23,21.9,21,20.2,19.399999999999999,18.7]
[31,273.2,139.1,94.4,72.099999999999994,58.8,49.8,43.5,38.700000000000003,35,32.1,29.7,27.7,26,24.6,23.3,22.2,21.3,20.399999999999999,19.7,19]
[32,276.89999999999998,141,95.7,73.099999999999994,59.6,50.5,44.1,39.299999999999997,35.5,32.5,30.1,28.1,26.4,24.9,23.6,22.5,21.6,20.7,20,19.3]
[33,280.7,142.9,97,74.099999999999994,60.4,51.2,44.7,39.799999999999997,36,33,30.5,28.5,26.7,25.2,24,22.9,21.9,21,20.2,19.600000000000001]
[34,284.5,144.9,98.4,75.099999999999994,61.2,51.9,45.3,40.299999999999997,36.5,33.4,30.9,28.9,27.1,25.6,24.3,23.2,22.2,21.3,20.5,19.8]
[35,288.39999999999998,146.9,99.7,76.2,62,52.6,45.9,40.9,37,33.9,31.4,29.3,27.5,26,24.6,23.5,22.5,21.6,20.8,20.100000000000001]
[36,292.3,148.9,101.1,77.2,62.9,53.4,46.6,41.5,37.5,34.4,31.8,29.7,27.9,26.3,25,23.8,22.8,21.9,21.1,20.399999999999999]
[37,296.3,150.9,102.4,78.2,63.7,54.1,47.2,42,38,34.799999999999997,32.200000000000003,30.1,28.3,26.7,25.4,24.2,23.2,22.2,21.4,20.7]
[38,300.3,152.9,103.8,79.3,64.599999999999994,54.8,47.8,42.6,38.6,35.299999999999997,32.700000000000003,30.5,28.7,27.1,25.7,24.5,23.5,22.6,21.8,21]
[39,304.39999999999998,155,105.3,80.400000000000006,65.5,55.6,48.5,43.2,39.1,35.799999999999997,33.200000000000003,30.9,29.1,27.5,26.1,24.9,23.8,22.9,22.1,21.3]
[40,308.5,157.1,106.7,81.5,66.400000000000006,56.3,49.2,43.8,39.700000000000003,36.299999999999997,33.6,31.4,29.5,27.9,26.5,25.3,24.2,23.3,22.4,21.7]
[41,312.7,159.30000000000001,108.1,82.6,67.3,57.1,49.9,44.4,40.200000000000003,36.799999999999997,34.1,31.8,29.9,28.3,26.9,25.6,24.6,23.6,22.8,22]
[42,316.89999999999998,161.4,109.6,83.8,68.2,57.9,50.6,45.1,40.799999999999997,37.4,34.6,32.299999999999997,30.3,28.7,27.3,26,24.9,24,23.1,22.4]
[43,321.2,163.6,111.1,84.9,69.2,58.7,51.3,45.7,41.4,37.9,35.1,32.799999999999997,30.8,29.1,27.7,26.4,25.3,24.3,23.5,22.7]
[44,325.60000000000002,165.9,112.7,86.1,70.2,59.6,52,46.3,42,38.5,35.6,33.200000000000003,31.3,29.6,28.1,26.8,25.7,24.7,23.8,23.1]
[45,330,168.1,114.2,87.3,71.099999999999994,60.4,52.7,47,42.6,39,36.1,33.700000000000003,31.7,30,28.5,27.2,26.1,25.1,24.2]
[46,334.4,170.4,115.8,88.5,72.099999999999994,61.2,53.5,47.7,43.2,39.6,36.700000000000003,34.299999999999997,32.200000000000003,30.5,29,27.7,26.5,25.5]
[47,338.9,172.7,117.4,89.7,73.099999999999994,62.1,54.3,48.4,43.8,40.200000000000003,37.200000000000003,34.799999999999997,32.700000000000003,30.9,29.4,28.1,26.9]
[48,343.5,175.1,119,91,74.2,63,55,49.1,44.5,40.799999999999997,37.799999999999997,35.299999999999997,33.200000000000003,31.4,29.9,28.5]
[49,348.1,177.5,120.6,92.2,75.2,63.9,55.8,49.8,45.1,41.4,38.4,35.799999999999997,33.700000000000003,31.9,30.4]
[50,352.8,179.9,122.3,93.5,76.3,64.8,56.6,50.5,45.8,42,38.9,36.4,34.200000000000003,32.4]
[51,357.5,182.3,124,94.8,77.3,65.7,57.5,51.3,46.5,42.6,39.5,36.9,34.799999999999997]
[52,362.3,184.8,125.7,96.1,78.400000000000006,66.7,58.3,52,47.2,43.3,40.1,37.5]
[53,367.2,187.3,127.4,97.5,79.599999999999994,67.599999999999994,59.1,52.8,47.9,43.9,40.700000000000003]
[54,372.2,189.9,129.19999999999999,98.9,80.7,68.599999999999994,60,53.6,48.6,44.6]
[55,377.3,192.5,131,100.3,81.900000000000006,69.599999999999994,60.9,54.4,49.3]
[56,382.5,195.2,132.80000000000001,101.7,83.1,70.599999999999994,61.8,55.2]
[57,387.8,198,134.69999999999999,103.2,84.3,71.7,62.7]
[58,393.3,200.8,136.69999999999999,104.7,85.5,72.8]
[59,397.2,202.8,138.1,105.8,86.5]
[60,399,203.8,138.80000000000001,106.4]
[61,400.9,204.8,139.5]
[62,403.3,206.1]
[63,405.4]

{"sheet":"x-719","index":113,"n_rows":69,"n_cols":21,"rows_kept":69,"cut":false,"hidden":false,"merged":[]}
["Government Actuary's Department"]
[{"$f":"IF(title=\"> Enter workbook title here\",\"Enter workbook title in Cover sheet\",title)","v":"TPS (England & Wales) - Consolidated Factor Spreadsheet"}]
[{"$f":"TABLE_FACTOR_TYPE&\" - x-\"&TABLE_SERIES_NUMBER","v":"Added pension - x-719"}]
[]
[]
["Data Item","Factor Table Information"]
["Client","TPS_EW"]
["Section","Final Salary"]
["Factor Type","Added pension"]
["Description","Personal and dependant's benefits, NPA 65. (Regular contribution elections made on or before 22 June 2010) Monthly contribution per £250 AP at date of election, £"]
["Gender","Unisex"]
["Factor Age/Period Definition","Age when notice of election given/ Payment period (in years)"]
["Section Number",1]
["Series Number",719]
["Table Reference","x-719"]
["Table Reference in Guidance","Table R65D"]
["Associated Guidance Note","Teachers' Pension Scheme: Final salary sections and career average section\nPurchase of additional pension and ceasing monthly contribution elections: Factors and guidance\nDate: 24 June 2019"]
["Date Factors Issued to Client","2023-10-17"]
["Date Factors Implemented (if known)"]
["Factor Status","Issued"]
[]
[null,{"$f":"HYPERLINK(\"#'Factor List'!A1\",\"Back to Factor List\")","v":"Back to Factor List"}]
[]
[]
["Age",1,2,3,4,5,6,7,8,9,10,11,12,13,14,15,16,17,18,19,20]
[20,255.1,129.9,88.2,67.3,54.8,46.5,40.6,36.1,32.700000000000003,29.9,27.7,25.8,24.2,22.9,21.7,20.7,19.8,19,18.3,17.7]
[21,258.60000000000002,131.69999999999999,89.4,68.3,55.6,47.2,41.1,36.6,33.1,30.3,28.1,26.2,24.6,23.2,22,21,20.100000000000001,19.3,18.600000000000001,17.899999999999999]
[22,262.2,133.5,90.6,69.2,56.4,47.8,41.7,37.1,33.6,30.8,28.5,26.5,24.9,23.5,22.3,21.3,20.399999999999999,19.600000000000001,18.8,18.2]
[23,265.8,135.30000000000001,91.9,70.2,57.1,48.5,42.3,37.700000000000003,34.1,31.2,28.9,26.9,25.3,23.9,22.6,21.6,20.7,19.8,19.100000000000001,18.399999999999999]
[24,269.5,137.19999999999999,93.1,71.099999999999994,57.9,49.1,42.9,38.200000000000003,34.5,31.6,29.3,27.3,25.6,24.2,23,21.9,20.9,20.100000000000001,19.399999999999999,18.7]
[25,273.2,139.1,94.4,72.099999999999994,58.7,49.8,43.5,38.700000000000003,35,32.1,29.7,27.7,26,24.5,23.3,22.2,21.2,20.399999999999999,19.600000000000001,19]
[26,276.89999999999998,141,95.7,73.099999999999994,59.5,50.5,44.1,39.200000000000003,35.5,32.5,30.1,28,26.3,24.9,23.6,22.5,21.5,20.7,19.899999999999999,19.2]
[27,280.7,142.9,97,74.099999999999994,60.4,51.2,44.7,39.799999999999997,36,33,30.5,28.4,26.7,25.2,23.9,22.8,21.8,21,20.2,19.5]
[28,284.60000000000002,144.9,98.4,75.099999999999994,61.2,51.9,45.3,40.299999999999997,36.5,33.4,30.9,28.8,27.1,25.6,24.3,23.1,22.1,21.3,20.5,19.8]
[29,288.39999999999998,146.9,99.7,76.099999999999994,62,52.6,45.9,40.9,37,33.9,31.3,29.2,27.4,25.9,24.6,23.5,22.4,21.6,20.8,20.100000000000001]
[30,292.39999999999998,148.9,101.1,77.2,62.9,53.3,46.5,41.4,37.5,34.299999999999997,31.8,29.6,27.8,26.3,24.9,23.8,22.8,21.9,21.1,20.3]
[31,296.3,150.9,102.5,78.2,63.7,54.1,47.2,42,38,34.799999999999997,32.200000000000003,30,28.2,26.6,25.3,24.1,23.1,22.2,21.4,20.6]
[32,300.39999999999998,153,103.8,79.3,64.599999999999994,54.8,47.8,42.6,38.5,35.299999999999997,32.6,30.4,28.6,27,25.6,24.4,23.4,22.5,21.7,20.9]
[33,304.39999999999998,155,105.3,80.400000000000006,65.5,55.6,48.5,43.2,39.1,35.799999999999997,33.1,30.9,29,27.4,26,24.8,23.7,22.8,22,21.2]
[34,308.60000000000002,157.1,106.7,81.5,66.400000000000006,56.3,49.1,43.8,39.6,36.299999999999997,33.5,31.3,29.4,27.8,26.4,25.1,24.1,23.1,22.3,21.5]
[35,312.7,159.30000000000001,108.1,82.6,67.3,57.1,49.8,44.4,40.1,36.799999999999997,34,31.7,29.8,28.1,26.7,25.5,24.4,23.4,22.6,21.8]
[36,316.89999999999998,161.4,109.6,83.7,68.2,57.9,50.5,45,40.700000000000003,37.299999999999997,34.5,32.200000000000003,30.2,28.5,27.1,25.9,24.8,23.8,22.9,22.1]
[37,321.2,163.6,111.1,84.8,69.099999999999994,58.6,51.2,45.6,41.2,37.799999999999997,35,32.6,30.6,28.9,27.5,26.2,25.1,24.1,23.2,22.5]
[38,325.5,165.8,112.6,86,70,59.4,51.9,46.2,41.8,38.299999999999997,35.4,33.1,31.1,29.4,27.9,26.6,25.5,24.5,23.6,22.8]
[39,329.9,168,114.1,87.1,71,60.2,52.6,46.8,42.4,38.799999999999997,35.9,33.5,31.5,29.8,28.3,27,25.8,24.8,23.9,23.1]
[40,334.3,170.3,115.6,88.3,72,61.1,53.3,47.5,43,39.4,36.4,34,31.9,30.2,28.7,27.4,26.2,25.2,24.3,23.5]
[41,338.8,172.6,117.2,89.5,72.900000000000006,61.9,54,48.1,43.6,39.9,37,34.5,32.4,30.6,29.1,27.8,26.6,25.6,24.7,23.8]
[42,343.3,174.9,118.8,90.7,73.900000000000006,62.7,54.8,48.8,44.2,40.5,37.5,35,32.9,31.1,29.5,28.2,27,26,25,24.2]
[43,347.9,177.2,120.4,92,74.900000000000006,63.6,55.5,49.5,44.8,41.1,38,35.5,33.4,31.5,30,28.6,27.4,26.4,25.4,24.6]
[44,352.5,179.6,122,93.2,76,64.5,56.3,50.2,45.4,41.6,38.6,36,33.799999999999997,32,30.4,29,27.8,26.8,25.8,25]
[45,357.2,182,123.6,94.5,77,65.400000000000006,57.1,50.9,46.1,42.2,39.1,36.5,34.299999999999997,32.5,30.9,29.5,28.3,27.2,26.2]
[46,361.9,184.4,125.3,95.7,78,66.3,57.9,51.6,46.7,42.9,39.700000000000003,37.1,34.9,33,31.3,29.9,28.7,27.6]
[47,366.7,186.9,127,97,79.099999999999994,67.2,58.7,52.3,47.4,43.5,40.299999999999997,37.6,35.4,33.5,31.8,30.4,29.1]
[48,371.5,189.3,128.69999999999999,98.4,80.2,68.099999999999994,59.5,53.1,48.1,44.1,40.9,38.200000000000003,35.9,34,32.299999999999997,30.9]
[49,376.3,191.8,130.4,99.7,81.3,69.099999999999994,60.4,53.8,48.8,44.8,41.5,38.700000000000003,36.5,34.5,32.799999999999997]
[50,381.2,194.4,132.1,101,82.4,70,61.2,54.6,49.5,45.4,42.1,39.299999999999997,37,35]
[51,386.2,196.9,133.9,102.4,83.5,71,62.1,55.4,50.2,46.1,42.7,39.9,37.6]
[52,391.2,199.5,135.69999999999999,103.8,84.7,72,62.9,56.2,50.9,46.7,43.3,40.5]
[53,396.3,202.1,137.5,105.2,85.9,73,63.8,57,51.6,47.4,44]
[54,401.4,204.8,139.30000000000001,106.6,87,74,64.7,57.8,52.4,48.1]
[55,406.7,207.5,141.19999999999999,108.1,88.2,75,65.599999999999994,58.6,53.2]
[56,412,210.3,143.1,109.6,89.5,76.099999999999994,66.599999999999994,59.5]
[57,417.5,213.1,145.1,111.1,90.7,77.2,67.5]
[58,423.1,216,147.1,112.6,92,78.3]
[59,426.9,218,148.5,113.7,92.9]
[60,428.5,218.9,149.1,114.2]
[61,430.1,219.8,149.69999999999999]
[62,432.3,220.9]
[63,434.1]

{"sheet":"x-720","index":114,"n_rows":65,"n_cols":3,"rows_kept":65,"cut":false,"hidden":false,"merged":[]}
["Government Actuary's Department"]
[{"$f":"IF(title=\"> Enter workbook title here\",\"Enter workbook title in Cover sheet\",title)","v":"TPS (England & Wales) - Consolidated Factor Spreadsheet"}]
[{"$f":"TABLE_FACTOR_TYPE&\" - x-\"&TABLE_SERIES_NUMBER","v":"Added pension - x-720"}]
[]
[]
["Data Item","Factor Table Information"]
["Client","TPS_EW"]
["Section","Final Salary"]
["Factor Type","Added pension"]
["Description","Purchase of outstanding amount by lump sum (election date on or before 22 June 2010). Single premium per £250 AP at date of election, £. - NPA 60"]
["Gender","Unisex"]
["Factor Age/Period Definition","Age when notice of election given"]
["Section Number",1]
["Series Number",720]
["Table Reference","x-720"]
["Table Reference in Guidance","Table SR60"]
["Associated Guidance Note","Teachers' Pension Scheme: Final salary sections and career average section\nPurchase of additional pension and ceasing monthly contribution elections: Factors and guidance\nDate: 24 June 2019"]
["Date Factors Issued to Client","2023-10-17"]
["Date Factors Implemented (if known)"]
["Factor Status","Issued"]
[]
[null,{"$f":"HYPERLINK(\"#'Factor List'!A1\",\"Back to Factor List\")","v":"Back to Factor List"}]
[]
[]
["Age","Personal","Personal and dependant’s"]
[20,3390,3620]
[21,3440,3670]
[22,3490,3720]
[23,3540,3780]
[24,3590,3830]
[25,3640,3880]
[26,3690,3940]
[27,3740,3990]
[28,3790,4050]
[29,3840,4110]
[30,3900,4160]
[31,3950,4220]
[32,4010,4280]
[33,4060,4340]
[34,4120,4400]
[35,4180,4460]
[36,4240,4520]
[37,4300,4590]
[38,4360,4650]
[39,4420,4710]
[40,4480,4780]
[41,4540,4850]
[42,4600,4910]
[43,4670,4980]
[44,4730,5050]
[45,4800,5120]
[46,4870,5190]
[47,4940,5260]
[48,5010,5330]
[49,5080,5410]
[50,5150,5480]
[51,5220,5560]
[52,5290,5630]
[53,5370,5710]
[54,5420,5760]
[55,5440,5780]
[56,5470,5800]
[57,5500,5830]
[58,5520,5850]
[59,5550,5880]

{"sheet":"x-721","index":115,"n_rows":70,"n_cols":3,"rows_kept":70,"cut":false,"hidden":false,"merged":[]}
["Government Actuary's Department"]
[{"$f":"IF(title=\"> Enter workbook title here\",\"Enter workbook title in Cover sheet\",title)","v":"TPS (England & Wales) - Consolidated Factor Spreadsheet"}]
[{"$f":"TABLE_FACTOR_TYPE&\" - x-\"&TABLE_SERIES_NUMBER","v":"Added pension - x-721"}]
[]
[]
["Data Item","Factor Table Information"]
["Client","TPS_EW"]
["Section","Final Salary"]
["Factor Type","Added pension"]
["Description","Purchase of outstanding amount by lump sum (election date on or before 22 June 2010). Single premium per £250 AP at date of election, £. - NPA 65"]
["Gender","Unisex"]
["Factor Age/Period Definition","Age when notice of election given"]
["Section Number",1]
["Series Number",721]
["Table Reference","x-721"]
["Table Reference in Guidance","Table SR65"]
["Associated Guidance Note","Teachers' Pension Scheme: Final salary sections and career average section\nPurchase of additional pension and ceasing monthly contribution elections: Factors and guidance\nDate: 24 June 2019"]
["Date Factors Issued to Client","2023-10-17"]
["Date Factors Implemented (if known)"]
["Factor Status","Issued"]
[]
[null,{"$f":"HYPERLINK(\"#'Factor List'!A1\",\"Back to Factor List\")","v":"Back to Factor List"}]
[]
[]
["Age","Personal","Personal and dependant’s"]
[20,2770,3010]
[21,2810,3050]
[22,2850,3090]
[23,2890,3130]
[24,2930,3170]
[25,2970,3220]
[26,3010,3260]
[27,3050,3310]
[28,3090,3350]
[29,3130,3400]
[30,3180,3440]
[31,3220,3490]
[32,3260,3540]
[33,3310,3590]
[34,3350,3640]
[35,3400,3680]
[36,3440,3730]
[37,3490,3780]
[38,3540,3830]
[39,3590,3890]
[40,3630,3940]
[41,3680,3990]
[42,3730,4040]
[43,3780,4100]
[44,3830,4150]
[45,3890,4210]
[46,3940,4260]
[47,3990,4320]
[48,4040,4370]
[49,4100,4430]
[50,4150,4490]
[51,4210,4540]
[52,4260,4600]
[53,4320,4660]
[54,4380,4720]
[55,4440,4780]
[56,4500,4840]
[57,4560,4910]
[58,4620,4970]
[59,4670,5020]
[60,4690,5030]
[61,4710,5050]
[62,4740,5080]
[63,4760,5100]
[64,4790,5120]

{"sheet":"x-722","index":116,"n_rows":77,"n_cols":2,"rows_kept":77,"cut":false,"hidden":false,"merged":[]}
["Government Actuary's Department"]
[{"$f":"IF(title=\"> Enter workbook title here\",\"Enter workbook title in Cover sheet\",title)","v":"TPS (England & Wales) - Consolidated Factor Spreadsheet"}]
[{"$f":"TABLE_FACTOR_TYPE&\" - x-\"&TABLE_SERIES_NUMBER","v":"Buy-out - x-722"}]
[]
[]
["Data Item","Factor Table Information"]
["Client","TPS_EW"]
["Section","Career Average"]
["Factor Type","Buy-out"]
["Description","Buy-out election contribution factors"]
["Gender","Unisex"]
["Factor Age/Period Definition","Age entered pensionable service in career average section"]
["Section Number",0]
["Series Number",722]
["Table Reference","x-722"]
["Table Reference in Guidance","Table BO1"]
["Associated Guidance Note","Teachers' Pension Scheme: Career average section\nElection to buy out the standard reduction: Factors and guidance\nDate: 11 September 2019"]
["Date Factors Issued to Client","2023-10-17"]
["Date Factors Implemented (if known)"]
["Factor Status","Issued"]
[]
[null,{"$f":"HYPERLINK(\"#'Factor List'!A1\",\"Back to Factor List\")","v":"Back to Factor List"}]
[]
[]
["Age","Factor for buying out the standard reduction for 1 year (percentage of pensionable earnings) (FBO)"]
[16,0.98]
[17,0.98]
[18,0.98]
[19,0.98]
[20,0.98]
[21,0.98]
[22,0.98]
[23,0.98]
[24,0.97]
[25,0.97]
[26,0.97]
[27,0.97]
[28,0.97]
[29,0.97]
[30,0.97]
[31,0.97]
[32,0.97]
[33,0.96]
[34,0.96]
[35,0.96]
[36,0.96]
[37,0.96]
[38,0.96]
[39,0.96]
[40,0.96]
[41,0.96]
[42,0.96]
[43,0.96]
[44,0.96]
[45,0.95]
[46,0.95]
[47,0.95]
[48,0.95]
[49,0.95]
[50,0.95]
[51,0.95]
[52,0.95]
[53,0.95]
[54,0.95]
[55,0.95]
[56,0.95]
[57,0.95]
[58,0.96]
[59,0.96]
[60,0.96]
[61,0.96]
[62,0.96]
[63,0.96]
[64,0.96]
[65,"Refer to GAD"]
[66,"Refer to GAD"]
[67,"Refer to GAD"]

{"sheet":"x-723","index":117,"n_rows":78,"n_cols":2,"rows_kept":78,"cut":false,"hidden":false,"merged":[]}
["Government Actuary's Department"]
[{"$f":"IF(title=\"> Enter workbook title here\",\"Enter workbook title in Cover sheet\",title)","v":"TPS (England & Wales) - Consolidated Factor Spreadsheet"}]
[{"$f":"TABLE_FACTOR_TYPE&\" - x-\"&TABLE_SERIES_NUMBER","v":"Buy-out - x-723"}]
[]
[]
["Data Item","Factor Table Information"]
["Client","TPS_EW"]
["Section","Career Average"]
["Factor Type","Buy-out"]
["Description","Buy-out value factors"]
["Gender","Unisex"]
["Factor Age/Period Definition","Number of years between age entered pensionable service in career average section and ‘buy-out retirement age"]
["Section Number",0]
["Series Number",723]
["Table Reference","x-723"]
["Table Reference in Guidance","Table BO2"]
["Associated Guidance Note","Teachers' Pension Scheme: Career average section\nElection to buy out the standard reduction: Factors and guidance\nDate: 11 September 2019"]
["Date Factors Issued to Client","2023-10-17"]
["Date Factors Implemented (if known)"]
["Factor Status","Issued"]
[]
[null,{"$f":"HYPERLINK(\"#'Factor List'!A1\",\"Back to Factor List\")","v":"Back to Factor List"}]
[]
[]
["Years between age entered pensionable service in CARE and buy out retirement age","Factor to determine buy-out value (FS)"]
[0,0]
[1,1.7999999999999999E-2]
[2,3.5999999999999997E-2]
[3,5.5E-2]
[4,7.4999999999999997E-2]
[5,9.5000000000000001E-2]
[6,0.11600000000000001]
[7,0.13800000000000001]
[8,0.16]
[9,0.184]
[10,0.20699999999999999]
[11,0.23200000000000001]
[12,0.25700000000000001]
[13,0.28399999999999997]
[14,0.311]
[15,0.33800000000000002]
[16,0.36699999999999999]
[17,0.39700000000000002]
[18,0.42699999999999999]
[19,0.45900000000000002]
[20,0.49099999999999999]
[21,0.52400000000000002]
[22,0.55900000000000005]
[23,0.59399999999999997]
[24,0.63]
[25,0.66800000000000004]
[26,0.70599999999999996]
[27,0.746]
[28,0.78700000000000003]
[29,0.82799999999999996]
[30,0.872]
[31,0.91600000000000004]
[32,0.96199999999999997]
[33,1.008]
[34,1.0569999999999999]
[35,1.1060000000000001]
[36,1.157]
[37,1.21]
[38,1.2629999999999999]
[39,1.319]
[40,1.375]
[41,1.4339999999999999]
[42,1.494]
[43,1.5549999999999999]
[44,1.619]
[45,1.6830000000000001]
[46,1.75]
[47,1.819]
[48,1.889]
[49,1.9610000000000001]
[50,2.0350000000000001]
[51,2.1110000000000002]
[52,2.1890000000000001]

{"sheet":"x-724","index":118,"n_rows":77,"n_cols":3,"rows_kept":77,"cut":false,"hidden":false,"merged":[]}
["Government Actuary's Department"]
[{"$f":"IF(title=\"> Enter workbook title here\",\"Enter workbook title in Cover sheet\",title)","v":"TPS (England & Wales) - Consolidated Factor Spreadsheet"}]
[{"$f":"TABLE_FACTOR_TYPE&\" - x-\"&TABLE_SERIES_NUMBER","v":"Faster accrual - x-724"}]
[]
[]
["Data Item","Factor Table Information"]
["Client","TPS_EW"]
["Section","Career Average"]
["Factor Type","Faster accrual"]
["Description","Faster accrual - contribution factors for a faster accrual rate of 1/45"]
["Gender","Unisex"]
["Factor Age/Period Definition","Age at date election takes effect"]
["Section Number",0]
["Series Number",724]
["Table Reference","x-724"]
["Table Reference in Guidance","Table FA45"]
["Associated Guidance Note","Teachers' Pension Scheme: Career average section\nFaster Accrual: Factors and guidance\nDate: 25 October 2019"]
["Date Factors Issued to Client","2023-10-17"]
["Date Factors Implemented (if known)"]
["Factor Status","Issued"]
[]
[null,{"$f":"HYPERLINK(\"#'Factor List'!A1\",\"Back to Factor List\")","v":"Back to Factor List"}]
[]
[]
["Age","Percentage of pensionable earnings payable - Faster accrual factor (FA)","Percentage of pensionable earnings payable - Additional buy-out factor, per year being bought out (BO)"]
[16,9.25,0.27]
[17,9.25,0.27]
[18,9.26,0.27]
[19,9.26,0.27]
[20,9.25,0.27]
[21,9.24,0.27]
[22,9.23,0.27]
[23,9.2200000000000006,0.27]
[24,9.2200000000000006,0.27]
[25,9.2100000000000009,0.27]
[26,9.1999999999999993,0.27]
[27,9.19,0.27]
[28,9.18,0.27]
[29,9.17,0.27]
[30,9.16,0.27]
[31,9.15,0.27]
[32,9.14,0.27]
[33,9.1300000000000008,0.27]
[34,9.1199999999999992,0.27]
[35,9.11,0.27]
[36,9.1,0.27]
[37,9.09,0.27]
[38,9.08,0.27]
[39,9.07,0.27]
[40,9.06,0.28000000000000003]
[41,9.0500000000000007,0.28000000000000003]
[42,9.0399999999999991,0.28000000000000003]
[43,9.0299999999999994,0.28000000000000003]
[44,9.02,0.28000000000000003]
[45,9.01,0.28000000000000003]
[46,9,0.28000000000000003]
[47,9.0500000000000007,0.28000000000000003]
[48,9.11,0.28000000000000003]
[49,9.17,0.28000000000000003]
[50,9.23,0.28000000000000003]
[51,9.2100000000000009,0.28000000000000003]
[52,9.1999999999999993,0.28000000000000003]
[53,9.19,0.28999999999999998]
[54,9.18,0.28999999999999998]
[55,9.16,0.28999999999999998]
[56,9.15,0.28999999999999998]
[57,9.14,0.28999999999999998]
[58,9.1300000000000008,0.28999999999999998]
[59,9.1199999999999992,0.3]
[60,9.11,0.3]
[61,9.11,0.3]
[62,9.1,0.3]
[63,9.1,0.31]
[64,9.18,0.31]
[65,9.42,"Refer to GAD"]
[66,"Refer to GAD","Refer to GAD"]
[67,"Refer to GAD","Refer to GAD"]

{"sheet":"x-725","index":119,"n_rows":77,"n_cols":3,"rows_kept":77,"cut":false,"hidden":false,"merged":[]}
["Government Actuary's Department"]
[{"$f":"IF(title=\"> Enter workbook title here\",\"Enter workbook title in Cover sheet\",title)","v":"TPS (England & Wales) - Consolidated Factor Spreadsheet"}]
[{"$f":"TABLE_FACTOR_TYPE&\" - x-\"&TABLE_SERIES_NUMBER","v":"Faster accrual - x-725"}]
[]
[]
["Data Item","Factor Table Information"]
["Client","TPS_EW"]
["Section","Career Average"]
["Factor Type","Faster accrual"]
["Description","Faster accrual - contribution factors for a faster accrual rate of 1/50"]
["Gender","Unisex"]
["Factor Age/Period Definition","Age at date election takes effect"]
["Section Number",0]
["Series Number",725]
["Table Reference","x-725"]
["Table Reference in Guidance","Table FA50"]
["Associated Guidance Note","Teachers' Pension Scheme: Career average section\nFaster Accrual: Factors and guidance\nDate: 25 October 2019"]
["Date Factors Issued to Client","2023-10-17"]
["Date Factors Implemented (if known)"]
["Factor Status","Issued"]
[]
[null,{"$f":"HYPERLINK(\"#'Factor List'!A1\",\"Back to Factor List\")","v":"Back to Factor List"}]
[]
[]
["Age","Percentage of pensionable earnings payable - Faster accrual factor (FA)","Percentage of pensionable earnings payable - Additional buy-out factor, per year being bought out (BO)"]
[16,4.8499999999999996,0.14000000000000001]
[17,4.8600000000000003,0.14000000000000001]
[18,4.8600000000000003,0.14000000000000001]
[19,4.8600000000000003,0.14000000000000001]
[20,4.8600000000000003,0.14000000000000001]
[21,4.8499999999999996,0.14000000000000001]
[22,4.8499999999999996,0.14000000000000001]
[23,4.84,0.14000000000000001]
[24,4.84,0.14000000000000001]
[25,4.83,0.14000000000000001]
[26,4.83,0.14000000000000001]
[27,4.82,0.14000000000000001]
[28,4.82,0.14000000000000001]
[29,4.8099999999999996,0.14000000000000001]
[30,4.8099999999999996,0.14000000000000001]
[31,4.8,0.14000000000000001]
[32,4.8,0.14000000000000001]
[33,4.79,0.14000000000000001]
[34,4.79,0.14000000000000001]
[35,4.78,0.14000000000000001]
[36,4.78,0.14000000000000001]
[37,4.7699999999999996,0.14000000000000001]
[38,4.7699999999999996,0.14000000000000001]
[39,4.76,0.14000000000000001]
[40,4.76,0.14000000000000001]
[41,4.75,0.14000000000000001]
[42,4.75,0.15]
[43,4.74,0.15]
[44,4.7300000000000004,0.15]
[45,4.7300000000000004,0.15]
[46,4.72,0.15]
[47,4.75,0.15]
[48,4.78,0.15]
[49,4.8099999999999996,0.15]
[50,4.84,0.15]
[51,4.84,0.15]
[52,4.83,0.15]
[53,4.82,0.15]
[54,4.82,0.15]
[55,4.8099999999999996,0.15]
[56,4.8,0.15]
[57,4.8,0.15]
[58,4.79,0.15]
[59,4.79,0.16]
[60,4.78,0.16]
[61,4.78,0.16]
[62,4.78,0.16]
[63,4.78,0.16]
[64,4.82,0.16]
[65,4.9400000000000004,"Refer to GAD"]
[66,"Refer to GAD","Refer to GAD"]
[67,"Refer to GAD","Refer to GAD"]

{"sheet":"x-726","index":120,"n_rows":77,"n_cols":3,"rows_kept":77,"cut":false,"hidden":false,"merged":[]}
["Government Actuary's Department"]
[{"$f":"IF(title=\"> Enter workbook title here\",\"Enter workbook title in Cover sheet\",title)","v":"TPS (England & Wales) - Consolidated Factor Spreadsheet"}]
[{"$f":"TABLE_FACTOR_TYPE&\" - x-\"&TABLE_SERIES_NUMBER","v":"Faster accrual - x-726"}]
[]
[]
["Data Item","Factor Table Information"]
["Client","TPS_EW"]
["Section","Career Average"]
["Factor Type","Faster accrual"]
["Description","Faster accrual - contribution factors for a faster accrual rate of 1/55"]
["Gender","Unisex"]
["Factor Age/Period Definition","Age at date election takes effect"]
["Section Number",0]
["Series Number",726]
["Table Reference","x-726"]
["Table Reference in Guidance","Table FA55"]
["Associated Guidance Note","Teachers' Pension Scheme: Career average section\nFaster Accrual: Factors and guidance\nDate: 25 October 2019"]
["Date Factors Issued to Client","2023-10-17"]
["Date Factors Implemented (if known)"]
["Factor Status","Issued"]
[]
[null,{"$f":"HYPERLINK(\"#'Factor List'!A1\",\"Back to Factor List\")","v":"Back to Factor List"}]
[]
[]
["Age","Percentage of pensionable earnings payable - Faster accrual factor (FA)","Percentage of pensionable earnings payable - Additional buy-out factor, per year being bought out (BO)"]
[16,1.26,0.04]
[17,1.26,0.04]
[18,1.26,0.04]
[19,1.26,0.04]
[20,1.26,0.04]
[21,1.26,0.04]
[22,1.26,0.04]
[23,1.26,0.04]
[24,1.26,0.04]
[25,1.26,0.04]
[26,1.25,0.04]
[27,1.25,0.04]
[28,1.25,0.04]
[29,1.25,0.04]
[30,1.25,0.04]
[31,1.25,0.04]
[32,1.25,0.04]
[33,1.25,0.04]
[34,1.24,0.04]
[35,1.24,0.04]
[36,1.24,0.04]
[37,1.24,0.04]
[38,1.24,0.04]
[39,1.24,0.04]
[40,1.24,0.04]
[41,1.23,0.04]
[42,1.23,0.04]
[43,1.23,0.04]
[44,1.23,0.04]
[45,1.23,0.04]
[46,1.23,0.04]
[47,1.23,0.04]
[48,1.24,0.04]
[49,1.25,0.04]
[50,1.26,0.04]
[51,1.26,0.04]
[52,1.25,0.04]
[53,1.25,0.04]
[54,1.25,0.04]
[55,1.25,0.04]
[56,1.25,0.04]
[57,1.25,0.04]
[58,1.25,0.04]
[59,1.24,0.04]
[60,1.24,0.04]
[61,1.24,0.04]
[62,1.24,0.04]
[63,1.24,0.04]
[64,1.25,0.04]
[65,1.28,"Refer to GAD"]
[66,"Refer to GAD","Refer to GAD"]
[67,"Refer to GAD","Refer to GAD"]

{"sheet":"x-727","index":121,"n_rows":81,"n_cols":4,"rows_kept":81,"cut":false,"hidden":false,"merged":[]}
["Government Actuary's Department"]
[{"$f":"IF(title=\"> Enter workbook title here\",\"Enter workbook title in Cover sheet\",title)","v":"TPS (England & Wales) - Consolidated Factor Spreadsheet"}]
[{"$f":"TABLE_FACTOR_TYPE&\" - x-\"&TABLE_SERIES_NUMBER","v":"Faster accrual - x-727"}]
[]
[]
["Data Item","Factor Table Information"]
["Client","TPS_EW"]
["Section","Career Average"]
["Factor Type","Faster accrual"]
["Description","Faster accrual value factors"]
["Gender","Unisex"]
["Factor Age/Period Definition","Number of years between age and expected NPA/buy-out retirement age"]
["Section Number",0]
["Series Number",727]
["Table Reference","x-727"]
["Table Reference in Guidance","Table FAV1"]
["Associated Guidance Note","Teachers' Pension Scheme: Career average section\nFaster Accrual: Factors and guidance\nDate: 25 October 2019"]
["Date Factors Issued to Client","2023-10-17"]
["Date Factors Implemented (if known)"]
["Factor Status","Issued"]
[]
[null,{"$f":"HYPERLINK(\"#'Factor List'!A1\",\"Back to Factor List\")","v":"Back to Factor List"}]
[]
["Faster accrual value: where a member’s buy-out election applies to their faster accrual election - Factor to apply when calculating the faster accrual value (para 3.7)",5.5E-2]
[]
[]
[]
["Number of years between age and expected NPA/buy-out retirement age","Factor to determine faster accrual value (FY) - faster accrual rate chosen - (1/45)","Factor to determine faster accrual value (FY) - faster accrual rate chosen - (1/50)","Factor to determine faster accrual value (FY) - faster accrual rate chosen - (1/55)"]
[0,0,0,0]
[1,4.7999999999999996E-3,2.5000000000000001E-3,5.9999999999999995E-4]
[2,4.7999999999999996E-3,2.5000000000000001E-3,6.9999999999999999E-4]
[3,4.8999999999999998E-3,2.5999999999999999E-3,6.9999999999999999E-4]
[4,5.0000000000000001E-3,2.5999999999999999E-3,6.9999999999999999E-4]
[5,5.1000000000000004E-3,2.7000000000000001E-3,6.9999999999999999E-4]
[6,5.1000000000000004E-3,2.7000000000000001E-3,6.9999999999999999E-4]
[7,5.1999999999999998E-3,2.7000000000000001E-3,6.9999999999999999E-4]
[8,5.3E-3,2.8E-3,6.9999999999999999E-4]
[9,5.4000000000000003E-3,2.8E-3,6.9999999999999999E-4]
[10,5.4999999999999997E-3,2.8999999999999998E-3,6.9999999999999999E-4]
[11,5.5999999999999999E-3,2.8999999999999998E-3,8.0000000000000004E-4]
[12,5.7000000000000002E-3,3.0000000000000001E-3,8.0000000000000004E-4]
[13,5.7999999999999996E-3,3.0000000000000001E-3,8.0000000000000004E-4]
[14,5.7999999999999996E-3,3.0999999999999999E-3,8.0000000000000004E-4]
[15,5.8999999999999999E-3,3.0999999999999999E-3,8.0000000000000004E-4]
[16,6.0000000000000001E-3,3.2000000000000002E-3,8.0000000000000004E-4]
[17,6.1000000000000004E-3,3.2000000000000002E-3,8.0000000000000004E-4]
[18,6.1999999999999998E-3,3.3E-3,8.0000000000000004E-4]
[19,6.3E-3,3.3E-3,8.9999999999999998E-4]
[20,6.4000000000000003E-3,3.3999999999999998E-3,8.9999999999999998E-4]
[21,6.4999999999999997E-3,3.3999999999999998E-3,8.9999999999999998E-4]
[22,6.6E-3,3.5000000000000001E-3,8.9999999999999998E-4]
[23,6.7000000000000002E-3,3.5000000000000001E-3,8.9999999999999998E-4]
[24,6.7999999999999996E-3,3.5999999999999999E-3,8.9999999999999998E-4]
[25,7.0000000000000001E-3,3.7000000000000002E-3,8.9999999999999998E-4]
[26,7.1000000000000004E-3,3.7000000000000002E-3,1E-3]
[27,7.1999999999999998E-3,3.8E-3,1E-3]
[28,7.3000000000000001E-3,3.8E-3,1E-3]
[29,7.4000000000000003E-3,3.8999999999999998E-3,1E-3]
[30,7.4999999999999997E-3,4.0000000000000001E-3,1E-3]
[31,7.7000000000000002E-3,4.0000000000000001E-3,1E-3]
[32,7.7999999999999996E-3,4.1000000000000003E-3,1.1000000000000001E-3]
[33,7.9000000000000008E-3,4.1000000000000003E-3,1.1000000000000001E-3]
[34,8.0000000000000002E-3,4.1999999999999997E-3,1.1000000000000001E-3]
[35,8.2000000000000007E-3,4.3E-3,1.1000000000000001E-3]
[36,8.3000000000000001E-3,4.3E-3,1.1000000000000001E-3]
[37,8.3999999999999995E-3,4.4000000000000003E-3,1.1000000000000001E-3]
[38,8.6E-3,4.4999999999999997E-3,1.1999999999999999E-3]
[39,8.6999999999999994E-3,4.5999999999999999E-3,1.1999999999999999E-3]
[40,8.8000000000000005E-3,4.5999999999999999E-3,1.1999999999999999E-3]
[41,8.9999999999999993E-3,4.7000000000000002E-3,1.1999999999999999E-3]
[42,9.1000000000000004E-3,4.7999999999999996E-3,1.1999999999999999E-3]
[43,9.2999999999999992E-3,4.8999999999999998E-3,1.2999999999999999E-3]
[44,9.4000000000000004E-3,4.8999999999999998E-3,1.2999999999999999E-3]
[45,9.5999999999999992E-3,5.0000000000000001E-3,1.2999999999999999E-3]
[46,9.7000000000000003E-3,5.1000000000000004E-3,1.2999999999999999E-3]
[47,9.9000000000000008E-3,5.1999999999999998E-3,1.2999999999999999E-3]
[48,0.01,5.3E-3,1.4E-3]
[49,1.0200000000000001E-2,5.3E-3,1.4E-3]
[50,1.03E-2,5.4000000000000003E-3,1.4E-3]
[51,1.0500000000000001E-2,5.4999999999999997E-3,1.4E-3]
[52,1.0699999999999999E-2,5.5999999999999999E-3,1.5E-3]

{"sheet":"x-728","index":122,"n_rows":29,"n_cols":3,"rows_kept":29,"cut":false,"hidden":false,"merged":[]}
["Government Actuary's Department"]
[{"$f":"IF(title=\"> Enter workbook title here\",\"Enter workbook title in Cover sheet\",title)","v":"TPS (England & Wales) - Consolidated Factor Spreadsheet"}]
[{"$f":"TABLE_FACTOR_TYPE&\" - x-\"&TABLE_SERIES_NUMBER","v":"Additional Family Benefits - x-728"}]
[]
[]
["Data Item","Factor Table Information"]
["Client","TPS_EW"]
["Section","Final Salary"]
["Factor Type","Additional Family Benefits"]
["Description","Factors for calculating the cost of additional family benefits"]
["Gender","Male & Female"]
["Factor Age/Period Definition"]
["Section Number",1]
["Series Number",728]
["Table Reference","x-728"]
["Table Reference in Guidance","Table 801"]
["Associated Guidance Note","Teachers' Pension Scheme: Final salary section\nPurchasing additional family benefits: Factors and guidance\nDate: 11 September 2019"]
["Date Factors Issued to Client","2023-10-17"]
["Date Factors Implemented (if known)"]
["Factor Status","Issued"]
[]
[null,{"$f":"HYPERLINK(\"#'Factor List'!A1\",\"Back to Factor List\")","v":"Back to Factor List"}]
[]
[]
["Sex of Member","Sex of Beneficiary","Factor"]
["Male","Male",2.1000000000000001E-2]
["Male","Female",3.3000000000000002E-2]
["Female","Male",1.2999999999999999E-2]
["Female","Female",0.02]

{"sheet":"x-729","index":123,"n_rows":26,"n_cols":2,"rows_kept":26,"cut":false,"hidden":false,"merged":[]}
["Government Actuary's Department"]
[{"$f":"IF(title=\"> Enter workbook title here\",\"Enter workbook title in Cover sheet\",title)","v":"TPS (England & Wales) - Consolidated Factor Spreadsheet"}]
["Buy-out - x-729"]
[]
[]
["Data Item","Factor Table Information"]
["Client","TPS_EW"]
["Section","Career Average"]
["Factor Type","Buy-out"]
["Description","Buy-out value factors - multiplier factor BO3"]
["Gender","Unisex"]
["Factor Age/Period Definition"]
["Section Number",0]
["Series Number",729]
["Table Reference","x-729"]
["Table Reference in Guidance","Table BO3"]
["Associated Guidance Note","Teachers' Pension Scheme: Career average section\nElection to buy out the standard reduction: Factors and guidance\nDate: 11 September 2019"]
["Date Factors Issued to Client","2023-10-17"]
["Date Factors Implemented (if known)"]
["Factor Status","Issued"]
[]
[null,{"$f":"HYPERLINK(\"#'Factor List'!A1\",\"Back to Factor List\")","v":"Back to Factor List"}]
[]
[]
[null,"Multiplier factor"]
["all ages",3.5000000000000003E-2]

{"sheet":"x-801","index":124,"n_rows":71,"n_cols":2,"rows_kept":71,"cut":false,"hidden":false,"merged":[]}
["Government Actuary's Department"]
[{"$f":"IF(title=\"> Enter workbook title here\",\"Enter workbook title in Cover sheet\",title)","v":"TPS (England & Wales) - Consolidated Factor Spreadsheet"}]
[{"$f":"TABLE_FACTOR_TYPE&\" - x-\"&TABLE_SERIES_NUMBER","v":"Premature Retirement - x-801"}]
[]
[]
["Data Item","Factor Table Information"]
["Client","TPS_EW"]
["Section","All"]
["Factor Type","Premature Retirement"]
["Description","Factors for capitalising the cost of the member's annual compensation (per £1pa of additional pension)"]
["Gender","Unisex"]
["Factor Age/Period Definition","Age last birthday"]
["Section Number",1]
["Series Number",801]
["Table Reference","x-801"]
["Table Reference in Guidance","Table 702"]
["Associated Guidance Note","Teachers' Pension Scheme: Final salary sections and career average section\nPremature retirement: Factors for capitalising the cost of compensation\nDate: 3 October 2019"]
["Date Factors Issued to Client","2023-07-28"]
["Date Factors Implemented (if known)"]
["Factor Status","Issued"]
[]
[null,{"$f":"HYPERLINK(\"#'Factor List'!A1\",\"Back to Factor List\")","v":"Back to Factor List"}]
[]
[]
["Age","Pension"]
[55,25.4]
[56,24.9]
[57,24.3]
[58,23.7]
[59,23.1]
[60,22.5]
[61,21.8]
[62,21.2]
[63,20.6]
[64,19.899999999999999]
[65,19.3]
[66,18.7]
[67,18]
[68,17.399999999999999]
[69,16.7]
[70,16.100000000000001]
[71,15.4]
[72,14.7]
[73,14.1]
[74,13.4]
[75,12.8]
[76,12.1]
[77,11.5]
[78,10.8]
[79,10.199999999999999]
[80,9.6]
[81,9]
[82,8.4]
[83,7.9]
[84,7.3]
[85,6.8]
[86,6.3]
[87,5.8]
[88,5.4]
[89,5]
[90,4.5999999999999996]
[91,4.3]
[92,3.9]
[93,3.6]
[94,3.4]
[95,3.1]
[96,2.9]
[97,2.7]
[98,2.6]
[99,2.4]
[100,2.2999999999999998]

{"sheet":"x-802","index":125,"n_rows":71,"n_cols":2,"rows_kept":71,"cut":false,"hidden":false,"merged":[]}
["Government Actuary's Department"]
[{"$f":"IF(title=\"> Enter workbook title here\",\"Enter workbook title in Cover sheet\",title)","v":"TPS (England & Wales) - Consolidated Factor Spreadsheet"}]
[{"$f":"TABLE_FACTOR_TYPE&\" - x-\"&TABLE_SERIES_NUMBER","v":"Premature Retirement - x-802"}]
[]
[]
["Data Item","Factor Table Information"]
["Client","TPS_EW"]
["Section","All"]
["Factor Type","Premature Retirement"]
["Description","Factors for capitalising the cost of the contingent partner's long term compensation (per £1pa of additional pension)"]
["Gender","Unisex"]
["Factor Age/Period Definition","Age last birthday"]
["Section Number",1]
["Series Number",802]
["Table Reference","x-802"]
["Table Reference in Guidance","Table 712"]
["Associated Guidance Note","Teachers' Pension Scheme: Final salary sections and career average section\nPremature retirement: Factors for capitalising the cost of compensation\nDate: 3 October 2019"]
["Date Factors Issued to Client","2023-07-28"]
["Date Factors Implemented (if known)"]
["Factor Status","Issued"]
[]
[null,{"$f":"HYPERLINK(\"#'Factor List'!A1\",\"Back to Factor List\")","v":"Back to Factor List"}]
[]
[]
["Age","Pension"]
[55,1.7]
[56,1.7]
[57,1.7]
[58,1.7]
[59,1.8]
[60,1.8]
[61,1.8]
[62,1.8]
[63,1.8]
[64,1.8]
[65,1.8]
[66,1.8]
[67,1.8]
[68,1.8]
[69,1.7]
[70,1.7]
[71,1.6]
[72,1.6]
[73,1.6]
[74,1.5]
[75,1.4]
[76,1.4]
[77,1.4]
[78,1.4]
[79,1.2]
[80,1.1000000000000001]
[81,1]
[82,1]
[83,1]
[84,0.8]
[85,0.7]
[86,0.7]
[87,0.7]
[88,0.6]
[89,0.5]
[90,0.4]
[91,0.3]
[92,0.3]
[93,0.3]
[94,0.3]
[95,0.3]
[96,0.3]
[97,0.2]
[98,0.2]
[99,0.2]
[100,0.2]

{"sheet":"x-803","index":126,"n_rows":52,"n_cols":2,"rows_kept":52,"cut":false,"hidden":false,"merged":[]}
["Government Actuary's Department"]
[{"$f":"IF(title=\"> Enter workbook title here\",\"Enter workbook title in Cover sheet\",title)","v":"TPS (England & Wales) - Consolidated Factor Spreadsheet"}]
[{"$f":"TABLE_FACTOR_TYPE&\" - x-\"&TABLE_SERIES_NUMBER","v":"Capitalisation of outstanding PAY and AFB contributions - x-803"}]
[]
[]
["Data Item","Factor Table Information"]
["Client","TPS_EW"]
["Section","Final Salary"]
["Factor Type","Capitalisation of outstanding PAY and AFB contributions"]
["Description","Contributions due in respect of all of the remaining contribution period"]
["Gender","Unisex"]
["Factor Age/Period Definition","Outstanding contributions period (years)"]
["Section Number",1]
["Series Number",803]
["Table Reference","x-803"]
["Table Reference in Guidance","Table 901"]
["Associated Guidance Note","Teachers' Pension Scheme: Final salary section\nOutstanding contributions in respect of Past Added Years (PAY) and additional family benefit (AFB) contracts: Factors and guidance\nDate: 11 September 2019"]
["Date Factors Issued to Client","2023-10-17"]
["Date Factors Implemented (if known)"]
["Factor Status","Issued"]
[]
[null,{"$f":"HYPERLINK(\"#'Factor List'!A1\",\"Back to Factor List\")","v":"Back to Factor List"}]
[]
[]
["Years Early","PAY capitalisation factor"]
[0,0]
[1,1]
[2,2.0009999999999999]
[3,3.0030000000000001]
[4,4.0049999999999999]
[5,5.008]
[6,6.0119999999999996]
[7,7.016]
[8,8.0210000000000008]
[9,9.0259999999999998]
[10,10.032]
[11,11.039]
[12,12.045999999999999]
[13,13.054]
[14,14.063000000000001]
[15,15.071999999999999]
[16,16.082000000000001]
[17,17.093]
[18,18.103999999999999]
[19,19.116]
[20,20.129000000000001]
[21,21.141999999999999]
[22,22.155999999999999]
[23,23.17]
[24,24.184999999999999]
[25,25.201000000000001]
[26,26.218]

{"sheet":"x-804","index":127,"n_rows":217,"n_cols":12,"rows_kept":217,"cut":false,"hidden":false,"merged":[]}
["Government Actuary's Department"]
[{"$f":"IF(title=\"> Enter workbook title here\",\"Enter workbook title in Cover sheet\",title)","v":"TPS (England & Wales) - Consolidated Factor Spreadsheet"}]
[{"$f":"TABLE_FACTOR_TYPE&\" - x-\"&TABLE_SERIES_NUMBER","v":"Capitalisation of outstanding PAY and AFB contributions - x-804"}]
[]
[]
["Data Item","Factor Table Information"]
["Client","TPS_EW"]
["Section","Final Salary"]
["Factor Type","Capitalisation of outstanding PAY and AFB contributions"]
["Description","Contributions only due in respect of the contribution period after a member's 60th birthday"]
["Gender","Unisex"]
["Factor Age/Period Definition","Period of contributions outstanding from 60th birthday (in years) and Age (in years and months)"]
["Section Number",1]
["Series Number",804]
["Table Reference","x-804"]
["Table Reference in Guidance","Table 911"]
["Associated Guidance Note","Teachers' Pension Scheme: Final salary section\nOutstanding contributions in respect of Past Added Years (PAY) and additional family benefit (AFB) contracts: Factors and guidance\nDate: 11 September 2019"]
["Date Factors Issued to Client","2023-10-17"]
["Date Factors Implemented (if known)"]
["Factor Status","Issued"]
[]
[null,{"$f":"HYPERLINK(\"#'Factor List'!A1\",\"Back to Factor List\")","v":"Back to Factor List"}]
[]
[]
["Age",0,1,2,3,4,5,6,7,8,9,10]
["44/0",0,1.0109999999999999,2.0219999999999998,3.0339999999999998,4.0460000000000003,5.0599999999999996,6.0730000000000004,7.0880000000000001,8.1029999999999998,9.1189999999999998,10.135]
["44/1",0,1.0109999999999999,2.0219999999999998,3.0339999999999998,4.0460000000000003,5.0590000000000002,6.0730000000000004,7.0880000000000001,8.1029999999999998,9.1180000000000003,10.135]
["44/2",0,1.0109999999999999,2.0219999999999998,3.0329999999999999,4.0460000000000003,5.0590000000000002,6.0730000000000004,7.0869999999999997,8.1020000000000003,9.1180000000000003,10.134]
["44/3",0,1.01,2.0219999999999998,3.0329999999999999,4.0460000000000003,5.0590000000000002,6.0720000000000001,7.0869999999999997,8.1020000000000003,9.1170000000000009,10.134]
["44/4",0,1.01,2.0209999999999999,3.0329999999999999,4.0449999999999999,5.0579999999999998,6.0720000000000001,7.0860000000000003,8.1010000000000009,9.1170000000000009,10.132999999999999]
["44/5",0,1.01,2.0209999999999999,3.0329999999999999,4.0449999999999999,5.0579999999999998,6.0720000000000001,7.0860000000000003,8.1010000000000009,9.1159999999999997,10.132999999999999]
["44/6",0,1.01,2.0209999999999999,3.0329999999999999,4.0449999999999999,5.0579999999999998,6.0709999999999997,7.0860000000000003,8.1010000000000009,9.1159999999999997,10.132]
["44/7",0,1.01,2.0209999999999999,3.0329999999999999,4.0449999999999999,5.0579999999999998,6.0709999999999997,7.085,8.1,9.1159999999999997,10.132]
["44/8",0,1.01,2.0209999999999999,3.0329999999999999,4.0449999999999999,5.0570000000000004,6.0709999999999997,7.085,8.1,9.1150000000000002,10.131]
["44/9",0,1.01,2.0209999999999999,3.032,4.0439999999999996,5.0570000000000004,6.0709999999999997,7.085,8.0990000000000002,9.1150000000000002,10.131]
["44/10",0,1.01,2.0209999999999999,3.032,4.0439999999999996,5.0570000000000004,6.07,7.0839999999999996,8.0990000000000002,9.1140000000000008,10.130000000000001]
["44/11",0,1.01,2.0209999999999999,3.032,4.0439999999999996,5.0570000000000004,6.07,7.0839999999999996,8.0980000000000008,9.1140000000000008,10.129]
["45/0",0,1.01,2.0209999999999999,3.032,4.0439999999999996,5.056,6.07,7.0830000000000002,8.0980000000000008,9.1129999999999995,10.129]
["45/1",0,1.01,2.02,3.032,4.0439999999999996,5.056,6.069,7.0830000000000002,8.0969999999999995,9.1129999999999995,10.128]
["45/2",0,1.01,2.02,3.032,4.0430000000000001,5.056,6.069,7.0830000000000002,8.0969999999999995,9.1120000000000001,10.128]
["45/3",0,1.01,2.02,3.0310000000000001,4.0430000000000001,5.056,6.069,7.0819999999999999,8.0969999999999995,9.1120000000000001,10.127000000000001]
["45/4",0,1.01,2.02,3.0310000000000001,4.0430000000000001,5.0549999999999997,6.0679999999999996,7.0819999999999999,8.0960000000000001,9.1110000000000007,10.127000000000001]
["45/5",0,1.01,2.02,3.0310000000000001,4.0430000000000001,5.0549999999999997,6.0679999999999996,7.0819999999999999,8.0960000000000001,9.1110000000000007,10.125999999999999]
["45/6",0,1.01,2.02,3.0310000000000001,4.0419999999999998,5.0549999999999997,6.0679999999999996,7.0810000000000004,8.0950000000000006,9.11,10.125999999999999]
["45/7",0,1.01,2.02,3.0310000000000001,4.0419999999999998,5.0540000000000003,6.0670000000000002,7.0810000000000004,8.0950000000000006,9.11,10.125]
["45/8",0,1.01,2.02,3.0310000000000001,4.0419999999999998,5.0540000000000003,6.0670000000000002,7.08,8.0939999999999994,9.109,10.125]
["45/9",0,1.0089999999999999,2.02,3.03,4.0419999999999998,5.0540000000000003,6.0670000000000002,7.08,8.0939999999999994,9.109,10.124000000000001]
["45/10",0,1.0089999999999999,2.02,3.03,4.0419999999999998,5.0540000000000003,6.0659999999999998,7.08,8.0939999999999994,9.1080000000000005,10.122999999999999]
["45/11",0,1.0089999999999999,2.0190000000000001,3.03,4.0410000000000004,5.0529999999999999,6.0659999999999998,7.0789999999999997,8.093,9.1080000000000005,10.122999999999999]
["46/0",0,1.0089999999999999,2.0190000000000001,3.03,4.0410000000000004,5.0529999999999999,6.0659999999999998,7.0789999999999997,8.093,9.1069999999999993,10.122]
["46/1",0,1.0089999999999999,2.0190000000000001,3.03,4.0410000000000004,5.0529999999999999,6.0650000000000004,7.0780000000000003,8.0920000000000005,9.1069999999999993,10.122]
["46/2",0,1.0089999999999999,2.0190000000000001,3.03,4.0410000000000004,5.0529999999999999,6.0650000000000004,7.0780000000000003,8.0920000000000005,9.1059999999999999,10.121]
["46/3",0,1.0089999999999999,2.0190000000000001,3.0289999999999999,4.0410000000000004,5.0519999999999996,6.0650000000000004,7.0780000000000003,8.0909999999999993,9.1059999999999999,10.121]
["46/4",0,1.0089999999999999,2.0190000000000001,3.0289999999999999,4.04,5.0519999999999996,6.0640000000000001,7.077,8.0909999999999993,9.1050000000000004,10.119999999999999]
["46/5",0,1.0089999999999999,2.0190000000000001,3.0289999999999999,4.04,5.0519999999999996,6.0640000000000001,7.077,8.0909999999999993,9.1050000000000004,10.119999999999999]
["46/6",0,1.0089999999999999,2.0190000000000001,3.0289999999999999,4.04,5.0510000000000002,6.0640000000000001,7.077,8.09,9.1039999999999992,10.119]
["46/7",0,1.0089999999999999,2.0190000000000001,3.0289999999999999,4.04,5.0510000000000002,6.0629999999999997,7.0759999999999996,8.09,9.1039999999999992,10.119]
["46/8",0,1.0089999999999999,2.0179999999999998,3.0289999999999999,4.0389999999999997,5.0510000000000002,6.0629999999999997,7.0759999999999996,8.0890000000000004,9.1029999999999998,10.118]
["46/9",0,1.0089999999999999,2.0179999999999998,3.028,4.0389999999999997,5.0510000000000002,6.0629999999999997,7.0750000000000002,8.0890000000000004,9.1029999999999998,10.118]
["46/10",0,1.0089999999999999,2.0179999999999998,3.028,4.0389999999999997,5.05,6.0620000000000003,7.0750000000000002,8.0879999999999992,9.1020000000000003,10.117000000000001]
["46/11",0,1.0089999999999999,2.0179999999999998,3.028,4.0389999999999997,5.05,6.0620000000000003,7.0750000000000002,8.0879999999999992,9.1020000000000003,10.116]
["47/0",0,1.0089999999999999,2.0179999999999998,3.028,4.0389999999999997,5.05,6.0620000000000003,7.0739999999999998,8.0879999999999992,9.1010000000000009,10.116]
["47/1",0,1.0089999999999999,2.0179999999999998,3.028,4.0380000000000003,5.05,6.0609999999999999,7.0739999999999998,8.0869999999999997,9.1010000000000009,10.115]
["47/2",0,1.0089999999999999,2.0179999999999998,3.028,4.0380000000000003,5.0490000000000004,6.0609999999999999,7.0739999999999998,8.0869999999999997,9.1,10.115]
["47/3",0,1.0089999999999999,2.0179999999999998,3.0270000000000001,4.0380000000000003,5.0490000000000004,6.0609999999999999,7.0730000000000004,8.0860000000000003,9.1,10.114000000000001]
["47/4",0,1.008,2.0179999999999998,3.0270000000000001,4.0380000000000003,5.0490000000000004,6.06,7.0730000000000004,8.0860000000000003,9.0990000000000002,10.114000000000001]
["47/5",0,1.008,2.0169999999999999,3.0270000000000001,4.0380000000000003,5.0490000000000004,6.06,7.0720000000000001,8.0850000000000009,9.0990000000000002,10.113]
["47/6",0,1.008,2.0169999999999999,3.0270000000000001,4.0369999999999999,5.048,6.06,7.0720000000000001,8.0850000000000009,9.0980000000000008,10.113]
["47/7",0,1.008,2.0169999999999999,3.0270000000000001,4.0369999999999999,5.048,6.06,7.0720000000000001,8.0850000000000009,9.0980000000000008,10.112]
["47/8",0,1.008,2.0169999999999999,3.0270000000000001,4.0369999999999999,5.048,6.0590000000000002,7.0709999999999997,8.0839999999999996,9.0980000000000008,10.112]
["47/9",0,1.008,2.0169999999999999,3.0270000000000001,4.0369999999999999,5.0469999999999997,6.0590000000000002,7.0709999999999997,8.0839999999999996,9.0969999999999995,10.111000000000001]
["47/10",0,1.008,2.0169999999999999,3.0259999999999998,4.0359999999999996,5.0469999999999997,6.0590000000000002,7.0709999999999997,8.0830000000000002,9.0969999999999995,10.111000000000001]
["47/11",0,1.008,2.0169999999999999,3.0259999999999998,4.0359999999999996,5.0469999999999997,6.0579999999999998,7.07,8.0830000000000002,9.0960000000000001,10.11]
["48/0",0,1.008,2.0169999999999999,3.0259999999999998,4.0359999999999996,5.0469999999999997,6.0579999999999998,7.07,8.0820000000000007,9.0960000000000001,10.109]
["48/1",0,1.008,2.0169999999999999,3.0259999999999998,4.0359999999999996,5.0460000000000003,6.0579999999999998,7.069,8.0820000000000007,9.0950000000000006,10.109]
["48/2",0,1.008,2.016,3.0259999999999998,4.0359999999999996,5.0460000000000003,6.0570000000000004,7.069,8.0820000000000007,9.0950000000000006,10.108000000000001]
["48/3",0,1.008,2.016,3.0259999999999998,4.0350000000000001,5.0460000000000003,6.0570000000000004,7.069,8.0809999999999995,9.0939999999999994,10.108000000000001]
["48/4",0,1.008,2.016,3.0249999999999999,4.0350000000000001,5.0460000000000003,6.0570000000000004,7.0679999999999996,8.0809999999999995,9.0939999999999994,10.106999999999999]
["48/5",0,1.008,2.016,3.0249999999999999,4.0350000000000001,5.0449999999999999,6.056,7.0679999999999996,8.08,9.093,10.106999999999999]
["48/6",0,1.008,2.016,3.0249999999999999,4.0350000000000001,5.0449999999999999,6.056,7.0679999999999996,8.08,9.093,10.106]
["48/7",0,1.008,2.016,3.0249999999999999,4.0350000000000001,5.0449999999999999,6.056,7.0670000000000002,8.0790000000000006,9.0920000000000005,10.106]
["48/8",0,1.008,2.016,3.0249999999999999,4.0339999999999998,5.0439999999999996,6.0549999999999997,7.0670000000000002,8.0790000000000006,9.0920000000000005,10.105]
["48/9",0,1.008,2.016,3.0249999999999999,4.0339999999999998,5.0439999999999996,6.0549999999999997,7.0659999999999998,8.0779999999999994,9.0909999999999993,10.105]
["48/10",0,1.0069999999999999,2.016,3.024,4.0339999999999998,5.0439999999999996,6.0549999999999997,7.0659999999999998,8.0779999999999994,9.0909999999999993,10.103999999999999]
["48/11",0,1.0069999999999999,2.016,3.024,4.0339999999999998,5.0439999999999996,6.0540000000000003,7.0659999999999998,8.0779999999999994,9.09,10.103999999999999]
["49/0",0,1.0069999999999999,2.0150000000000001,3.024,4.0330000000000004,5.0430000000000001,6.0540000000000003,7.0650000000000004,8.077,9.09,10.103]
["49/1",0,1.0069999999999999,2.0150000000000001,3.024,4.0330000000000004,5.0430000000000001,6.0540000000000003,7.0650000000000004,8.077,9.0890000000000004,10.102]
["49/2",0,1.0069999999999999,2.0150000000000001,3.024,4.0330000000000004,5.0430000000000001,6.0529999999999999,7.0650000000000004,8.0760000000000005,9.0890000000000004,10.102]
["49/3",0,1.0069999999999999,2.0150000000000001,3.024,4.0330000000000004,5.0430000000000001,6.0529999999999999,7.0640000000000001,8.0760000000000005,9.0879999999999992,10.101000000000001]
["49/4",0,1.0069999999999999,2.0150000000000001,3.0230000000000001,4.0330000000000004,5.0419999999999998,6.0529999999999999,7.0640000000000001,8.0749999999999993,9.0879999999999992,10.101000000000001]
["49/5",0,1.0069999999999999,2.0150000000000001,3.0230000000000001,4.032,5.0419999999999998,6.0519999999999996,7.0629999999999997,8.0749999999999993,9.0869999999999997,10.1]
["49/6",0,1.0069999999999999,2.0150000000000001,3.0230000000000001,4.032,5.0419999999999998,6.0519999999999996,7.0629999999999997,8.0749999999999993,9.0869999999999997,10.1]
["49/7",0,1.0069999999999999,2.0150000000000001,3.0230000000000001,4.032,5.0419999999999998,6.0519999999999996,7.0629999999999997,8.0739999999999998,9.0860000000000003,10.099]
["49/8",0,1.0069999999999999,2.0150000000000001,3.0230000000000001,4.032,5.0410000000000004,6.0510000000000002,7.0620000000000003,8.0739999999999998,9.0860000000000003,10.099]
["49/9",0,1.0069999999999999,2.0139999999999998,3.0230000000000001,4.0309999999999997,5.0410000000000004,6.0510000000000002,7.0620000000000003,8.0730000000000004,9.0850000000000009,10.098000000000001]
["49/10",0,1.0069999999999999,2.0139999999999998,3.0219999999999998,4.0309999999999997,5.0410000000000004,6.0510000000000002,7.0620000000000003,8.0730000000000004,9.0850000000000009,10.098000000000001]
["49/11",0,1.0069999999999999,2.0139999999999998,3.0219999999999998,4.0309999999999997,5.04,6.05,7.0609999999999999,8.0719999999999992,9.0839999999999996,10.097]
["50/0",0,1.0069999999999999,2.0139999999999998,3.0219999999999998,4.0309999999999997,5.04,6.05,7.0609999999999999,8.0719999999999992,9.0839999999999996,10.097]
["50/1",0,1.0069999999999999,2.0139999999999998,3.0219999999999998,4.0309999999999997,5.04,6.05,7.06,8.0719999999999992,9.0830000000000002,10.096]
["50/2",0,1.0069999999999999,2.0139999999999998,3.0219999999999998,4.03,5.04,6.05,7.06,8.0709999999999997,9.0830000000000002,10.095000000000001]
["50/3",0,1.0069999999999999,2.0139999999999998,3.0219999999999998,4.03,5.0389999999999997,6.0490000000000004,7.06,8.0709999999999997,9.0820000000000007,10.095000000000001]
["50/4",0,1.0069999999999999,2.0139999999999998,3.0219999999999998,4.03,5.0389999999999997,6.0490000000000004,7.0590000000000002,8.07,9.0820000000000007,10.093999999999999]
["50/5",0,1.006,2.0139999999999998,3.0209999999999999,4.03,5.0389999999999997,6.0490000000000004,7.0590000000000002,8.07,9.0820000000000007,10.093999999999999]
["50/6",0,1.006,2.0129999999999999,3.0209999999999999,4.03,5.0389999999999997,6.048,7.0590000000000002,8.0690000000000008,9.0809999999999995,10.093]
["50/7",0,1.006,2.0129999999999999,3.0209999999999999,4.0289999999999999,5.0380000000000003,6.048,7.0579999999999998,8.0690000000000008,9.0809999999999995,10.093]
["50/8",0,1.006,2.0129999999999999,3.0209999999999999,4.0289999999999999,5.0380000000000003,6.048,7.0579999999999998,8.0690000000000008,9.08,10.092000000000001]
["50/9",0,1.006,2.0129999999999999,3.0209999999999999,4.0289999999999999,5.0380000000000003,6.0469999999999997,7.0570000000000004,8.0679999999999996,9.08,10.092000000000001]
["50/10",0,1.006,2.0129999999999999,3.0209999999999999,4.0289999999999999,5.0369999999999999,6.0469999999999997,7.0570000000000004,8.0679999999999996,9.0790000000000006,10.090999999999999]
["50/11",0,1.006,2.0129999999999999,3.02,4.0279999999999996,5.0369999999999999,6.0469999999999997,7.0570000000000004,8.0670000000000002,9.0790000000000006,10.090999999999999]
["51/0",0,1.006,2.0129999999999999,3.02,4.0279999999999996,5.0369999999999999,6.0460000000000003,7.056,8.0670000000000002,9.0779999999999994,10.09]
["51/1",0,1.006,2.0129999999999999,3.02,4.0279999999999996,5.0369999999999999,6.0460000000000003,7.056,8.0660000000000007,9.0779999999999994,10.09]
["51/2",0,1.006,2.0129999999999999,3.02,4.0279999999999996,5.0359999999999996,6.0460000000000003,7.0549999999999997,8.0660000000000007,9.077,10.089]
["51/3",0,1.006,2.0129999999999999,3.02,4.0279999999999996,5.0359999999999996,6.0449999999999999,7.0549999999999997,8.0660000000000007,9.077,10.087999999999999]
["51/4",0,1.006,2.012,3.02,4.0270000000000001,5.0359999999999996,6.0449999999999999,7.0549999999999997,8.0649999999999995,9.0760000000000005,10.087999999999999]
["51/5",0,1.006,2.012,3.0190000000000001,4.0270000000000001,5.0359999999999996,6.0449999999999999,7.0540000000000003,8.0649999999999995,9.0760000000000005,10.087]
["51/6",0,1.006,2.012,3.0190000000000001,4.0270000000000001,5.0350000000000001,6.0439999999999996,7.0540000000000003,8.0640000000000001,9.0749999999999993,10.087]
["51/7",0,1.006,2.012,3.0190000000000001,4.0270000000000001,5.0350000000000001,6.0439999999999996,7.0540000000000003,8.0640000000000001,9.0749999999999993,10.086]
["51/8",0,1.006,2.012,3.0190000000000001,4.0270000000000001,5.0350000000000001,6.0439999999999996,7.0529999999999999,8.0630000000000006,9.0739999999999998,10.086]
["51/9",0,1.006,2.012,3.0190000000000001,4.0259999999999998,5.0350000000000001,6.0430000000000001,7.0529999999999999,8.0630000000000006,9.0739999999999998,10.085000000000001]
["51/10",0,1.006,2.012,3.0190000000000001,4.0259999999999998,5.0339999999999998,6.0430000000000001,7.0519999999999996,8.0630000000000006,9.0730000000000004,10.085000000000001]
["51/11",0,1.006,2.012,3.0179999999999998,4.0259999999999998,5.0339999999999998,6.0430000000000001,7.0519999999999996,8.0619999999999994,9.0730000000000004,10.084]
["52/0",0,1.0049999999999999,2.012,3.0179999999999998,4.0259999999999998,5.0339999999999998,6.0419999999999998,7.0519999999999996,8.0619999999999994,9.0719999999999992,10.084]
["52/1",0,1.0049999999999999,2.0110000000000001,3.0179999999999998,4.0250000000000004,5.0330000000000004,6.0419999999999998,7.0510000000000002,8.0609999999999999,9.0719999999999992,10.083]
["52/2",0,1.0049999999999999,2.0110000000000001,3.0179999999999998,4.0250000000000004,5.0330000000000004,6.0419999999999998,7.0510000000000002,8.0609999999999999,9.0709999999999997,10.083]
["52/3",0,1.0049999999999999,2.0110000000000001,3.0179999999999998,4.0250000000000004,5.0330000000000004,6.0410000000000004,7.0510000000000002,8.06,9.0709999999999997,10.082000000000001]
["52/4",0,1.0049999999999999,2.0110000000000001,3.0179999999999998,4.0250000000000004,5.0330000000000004,6.0410000000000004,7.05,8.06,9.07,10.081]
["52/5",0,1.0049999999999999,2.0110000000000001,3.0169999999999999,4.0250000000000004,5.032,6.0410000000000004,7.05,8.06,9.07,10.081]
["52/6",0,1.0049999999999999,2.0110000000000001,3.0169999999999999,4.024,5.032,6.04,7.0490000000000004,8.0589999999999993,9.0690000000000008,10.08]
["52/7",0,1.0049999999999999,2.0110000000000001,3.0169999999999999,4.024,5.032,6.04,7.0490000000000004,8.0589999999999993,9.0690000000000008,10.08]
["52/8",0,1.0049999999999999,2.0110000000000001,3.0169999999999999,4.024,5.032,6.04,7.0490000000000004,8.0579999999999998,9.0679999999999996,10.079000000000001]
["52/9",0,1.0049999999999999,2.0110000000000001,3.0169999999999999,4.024,5.0309999999999997,6.04,7.048,8.0579999999999998,9.0679999999999996,10.079000000000001]
["52/10",0,1.0049999999999999,2.0099999999999998,3.0169999999999999,4.024,5.0309999999999997,6.0389999999999997,7.048,8.0570000000000004,9.0670000000000002,10.077999999999999]
["52/11",0,1.0049999999999999,2.0099999999999998,3.0169999999999999,4.0229999999999997,5.0309999999999997,6.0389999999999997,7.048,8.0570000000000004,9.0670000000000002,10.077999999999999]
["53/0",0,1.0049999999999999,2.0099999999999998,3.016,4.0229999999999997,5.0309999999999997,6.0389999999999997,7.0469999999999997,8.0570000000000004,9.0670000000000002,10.077]
["53/1",0,1.0049999999999999,2.0099999999999998,3.016,4.0229999999999997,5.03,6.0380000000000003,7.0469999999999997,8.0559999999999992,9.0660000000000007,10.077]
["53/2",0,1.0049999999999999,2.0099999999999998,3.016,4.0229999999999997,5.03,6.0380000000000003,7.0460000000000003,8.0559999999999992,9.0660000000000007,10.076000000000001]
["53/3",0,1.0049999999999999,2.0099999999999998,3.016,4.0220000000000002,5.03,6.0380000000000003,7.0460000000000003,8.0549999999999997,9.0649999999999995,10.076000000000001]
["53/4",0,1.0049999999999999,2.0099999999999998,3.016,4.0220000000000002,5.0289999999999999,6.0369999999999999,7.0460000000000003,8.0549999999999997,9.0649999999999995,10.074999999999999]
["53/5",0,1.0049999999999999,2.0099999999999998,3.016,4.0220000000000002,5.0289999999999999,6.0369999999999999,7.0449999999999999,8.0540000000000003,9.0640000000000001,10.074]
["53/6",0,1.004,2.0099999999999998,3.0150000000000001,4.0220000000000002,5.0289999999999999,6.0369999999999999,7.0449999999999999,8.0540000000000003,9.0640000000000001,10.074]
["53/7",0,1.004,2.0099999999999998,3.0150000000000001,4.0220000000000002,5.0289999999999999,6.0359999999999996,7.0449999999999999,8.0540000000000003,9.0630000000000006,10.073]
["53/8",0,1.004,2.0089999999999999,3.0150000000000001,4.0209999999999999,5.0279999999999996,6.0359999999999996,7.0439999999999996,8.0530000000000008,9.0630000000000006,10.073]
["53/9",0,1.004,2.0089999999999999,3.0150000000000001,4.0209999999999999,5.0279999999999996,6.0359999999999996,7.0439999999999996,8.0530000000000008,9.0619999999999994,10.071999999999999]
["53/10",0,1.004,2.0089999999999999,3.0150000000000001,4.0209999999999999,5.0279999999999996,6.0350000000000001,7.0430000000000001,8.0519999999999996,9.0619999999999994,10.071999999999999]
["53/11",0,1.004,2.0089999999999999,3.0150000000000001,4.0209999999999999,5.0279999999999996,6.0350000000000001,7.0430000000000001,8.0519999999999996,9.0609999999999999,10.071]
["54/0",0,1.004,2.0089999999999999,3.0139999999999998,4.0209999999999999,5.0270000000000001,6.0350000000000001,7.0430000000000001,8.0510000000000002,9.0609999999999999,10.071]
["54/1",0,1.004,2.0089999999999999,3.0139999999999998,4.0199999999999996,5.0270000000000001,6.0339999999999998,7.0419999999999998,8.0510000000000002,9.06,10.07]
["54/2",0,1.004,2.0089999999999999,3.0139999999999998,4.0199999999999996,5.0270000000000001,6.0339999999999998,7.0419999999999998,8.0510000000000002,9.06,10.07]
["54/3",0,1.004,2.0089999999999999,3.0139999999999998,4.0199999999999996,5.0259999999999998,6.0339999999999998,7.0419999999999998,8.0500000000000007,9.0589999999999993,10.069000000000001]
["54/4",0,1.004,2.0089999999999999,3.0139999999999998,4.0199999999999996,5.0259999999999998,6.0330000000000004,7.0410000000000004,8.0500000000000007,9.0589999999999993,10.069000000000001]
["54/5",0,1.004,2.008,3.0139999999999998,4.0190000000000001,5.0259999999999998,6.0330000000000004,7.0410000000000004,8.0489999999999995,9.0579999999999998,10.068]
["54/6",0,1.004,2.008,3.0129999999999999,4.0190000000000001,5.0259999999999998,6.0330000000000004,7.04,8.0489999999999995,9.0579999999999998,10.067]
["54/7",0,1.004,2.008,3.0129999999999999,4.0190000000000001,5.0250000000000004,6.032,7.04,8.048,9.0570000000000004,10.067]
["54/8",0,1.004,2.008,3.0129999999999999,4.0190000000000001,5.0250000000000004,6.032,7.04,8.048,9.0570000000000004,10.066000000000001]
["54/9",0,1.004,2.008,3.0129999999999999,4.0190000000000001,5.0250000000000004,6.032,7.0389999999999997,8.048,9.0559999999999992,10.066000000000001]
["54/10",0,1.004,2.008,3.0129999999999999,4.0179999999999998,5.0250000000000004,6.0309999999999997,7.0389999999999997,8.0470000000000006,9.0559999999999992,10.065]
["54/11",0,1.004,2.008,3.0129999999999999,4.0179999999999998,5.024,6.0309999999999997,7.0389999999999997,8.0470000000000006,9.0549999999999997,10.065]
["55/0",0,1.004,2.008,3.0129999999999999,4.0179999999999998,5.024,6.0309999999999997,7.0380000000000003,8.0459999999999994,9.0549999999999997,10.064]
["55/1",0,1.0029999999999999,2.008,3.012,4.0179999999999998,5.024,6.03,7.0380000000000003,8.0459999999999994,9.0540000000000003,10.064]
["55/2",0,1.0029999999999999,2.0070000000000001,3.012,4.0179999999999998,5.024,6.03,7.0369999999999999,8.0449999999999999,9.0540000000000003,10.063000000000001]
["55/3",0,1.0029999999999999,2.0070000000000001,3.012,4.0170000000000003,5.0229999999999997,6.03,7.0369999999999999,8.0449999999999999,9.0530000000000008,10.063000000000001]
["55/4",0,1.0029999999999999,2.0070000000000001,3.012,4.0170000000000003,5.0229999999999997,6.03,7.0369999999999999,8.0449999999999999,9.0530000000000008,10.061999999999999]
["55/5",0,1.0029999999999999,2.0070000000000001,3.012,4.0170000000000003,5.0229999999999997,6.0289999999999999,7.0359999999999996,8.0440000000000005,9.0530000000000008,10.061999999999999]
["55/6",0,1.0029999999999999,2.0070000000000001,3.012,4.0170000000000003,5.0220000000000002,6.0289999999999999,7.0359999999999996,8.0440000000000005,9.0519999999999996,10.061]
["55/7",0,1.0029999999999999,2.0070000000000001,3.0110000000000001,4.016,5.0220000000000002,6.0289999999999999,7.0359999999999996,8.0429999999999993,9.0519999999999996,10.06]
["55/8",0,1.0029999999999999,2.0070000000000001,3.0110000000000001,4.016,5.0220000000000002,6.0279999999999996,7.0350000000000001,8.0429999999999993,9.0510000000000002,10.06]
["55/9",0,1.0029999999999999,2.0070000000000001,3.0110000000000001,4.016,5.0220000000000002,6.0279999999999996,7.0350000000000001,8.0419999999999998,9.0510000000000002,10.058999999999999]
["55/10",0,1.0029999999999999,2.0070000000000001,3.0110000000000001,4.016,5.0209999999999999,6.0279999999999996,7.0339999999999998,8.0419999999999998,9.0500000000000007,10.058999999999999]
["55/11",0,1.0029999999999999,2.0070000000000001,3.0110000000000001,4.016,5.0209999999999999,6.0270000000000001,7.0339999999999998,8.0419999999999998,9.0500000000000007,10.058]
["56/0",0,1.0029999999999999,2.0059999999999998,3.0110000000000001,4.0149999999999997,5.0209999999999999,6.0270000000000001,7.0339999999999998,8.0410000000000004,9.0489999999999995,10.058]
["56/1",0,1.0029999999999999,2.0059999999999998,3.01,4.0149999999999997,5.0209999999999999,6.0270000000000001,7.0330000000000004,8.0410000000000004,9.0489999999999995,10.057]
["56/2",0,1.0029999999999999,2.0059999999999998,3.01,4.0149999999999997,5.0199999999999996,6.0259999999999998,7.0330000000000004,8.0399999999999991,9.048,10.057]
["56/3",0,1.0029999999999999,2.0059999999999998,3.01,4.0149999999999997,5.0199999999999996,6.0259999999999998,7.0330000000000004,8.0399999999999991,9.048,10.055999999999999]
["56/4",0,1.0029999999999999,2.0059999999999998,3.01,4.0149999999999997,5.0199999999999996,6.0259999999999998,7.032,8.0389999999999997,9.0470000000000006,10.055999999999999]
["56/5",0,1.0029999999999999,2.0059999999999998,3.01,4.0140000000000002,5.0199999999999996,6.0250000000000004,7.032,8.0389999999999997,9.0470000000000006,10.055]
["56/6",0,1.0029999999999999,2.0059999999999998,3.01,4.0140000000000002,5.0190000000000001,6.0250000000000004,7.0309999999999997,8.0389999999999997,9.0459999999999994,10.055]
["56/7",0,1.0029999999999999,2.0059999999999998,3.0089999999999999,4.0140000000000002,5.0190000000000001,6.0250000000000004,7.0309999999999997,8.0380000000000003,9.0459999999999994,10.054]
["56/8",0,1.002,2.0059999999999998,3.0089999999999999,4.0140000000000002,5.0190000000000001,6.024,7.0309999999999997,8.0380000000000003,9.0449999999999999,10.054]
["56/9",0,1.002,2.0049999999999999,3.0089999999999999,4.0129999999999999,5.0179999999999998,6.024,7.03,8.0370000000000008,9.0449999999999999,10.053000000000001]
["56/10",0,1.002,2.0049999999999999,3.0089999999999999,4.0129999999999999,5.0179999999999998,6.024,7.03,8.0370000000000008,9.0440000000000005,10.052]
["56/11",0,1.002,2.0049999999999999,3.0089999999999999,4.0129999999999999,5.0179999999999998,6.0229999999999997,7.03,8.0359999999999996,9.0440000000000005,10.052]
["57/0",0,1.002,2.0049999999999999,3.0089999999999999,4.0129999999999999,5.0179999999999998,6.0229999999999997,7.0289999999999999,8.0359999999999996,9.0429999999999993,10.051]
["57/1",0,1.002,2.0049999999999999,3.008,4.0129999999999999,5.0170000000000003,6.0229999999999997,7.0289999999999999,8.0359999999999996,9.0429999999999993,10.051]
["57/2",0,1.002,2.0049999999999999,3.008,4.0119999999999996,5.0170000000000003,6.0220000000000002,7.0279999999999996,8.0350000000000001,9.0419999999999998,10.050000000000001]
["57/3",0,1.002,2.0049999999999999,3.008,4.0119999999999996,5.0170000000000003,6.0220000000000002,7.0279999999999996,8.0350000000000001,9.0419999999999998,10.050000000000001]
["57/4",0,1.002,2.0049999999999999,3.008,4.0119999999999996,5.0170000000000003,6.0220000000000002,7.0279999999999996,8.0340000000000007,9.0410000000000004,10.048999999999999]
["57/5",0,1.002,2.0049999999999999,3.008,4.0119999999999996,5.016,6.0209999999999999,7.0270000000000001,8.0340000000000007,9.0410000000000004,10.048999999999999]
["57/6",0,1.002,2.004,3.008,4.0119999999999996,5.016,6.0209999999999999,7.0270000000000001,8.0329999999999995,9.0399999999999991,10.048]
["57/7",0,1.002,2.004,3.008,4.0110000000000001,5.016,6.0209999999999999,7.0270000000000001,8.0329999999999995,9.0399999999999991,10.048]
["57/8",0,1.002,2.004,3.0070000000000001,4.0110000000000001,5.0149999999999997,6.0209999999999999,7.0259999999999998,8.0329999999999995,9.0389999999999997,10.047000000000001]
["57/9",0,1.002,2.004,3.0070000000000001,4.0110000000000001,5.0149999999999997,6.02,7.0259999999999998,8.032,9.0389999999999997,10.047000000000001]
["57/10",0,1.002,2.004,3.0070000000000001,4.0110000000000001,5.0149999999999997,6.02,7.0250000000000004,8.032,9.0389999999999997,10.045999999999999]
["57/11",0,1.002,2.004,3.0070000000000001,4.01,5.0149999999999997,6.02,7.0250000000000004,8.0310000000000006,9.0380000000000003,10.045]
["58/0",0,1.002,2.004,3.0070000000000001,4.01,5.0140000000000002,6.0190000000000001,7.0250000000000004,8.0310000000000006,9.0380000000000003,10.045]
["58/1",0,1.002,2.004,3.0070000000000001,4.01,5.0140000000000002,6.0190000000000001,7.024,8.0299999999999994,9.0370000000000008,10.044]
["58/2",0,1.0009999999999999,2.004,3.0059999999999998,4.01,5.0140000000000002,6.0190000000000001,7.024,8.0299999999999994,9.0370000000000008,10.044]
["58/3",0,1.0009999999999999,2.004,3.0059999999999998,4.01,5.0140000000000002,6.0179999999999998,7.024,8.0299999999999994,9.0359999999999996,10.042999999999999]
["58/4",0,1.0009999999999999,2.0030000000000001,3.0059999999999998,4.0090000000000003,5.0129999999999999,6.0179999999999998,7.0229999999999997,8.0289999999999999,9.0359999999999996,10.042999999999999]
["58/5",0,1.0009999999999999,2.0030000000000001,3.0059999999999998,4.0090000000000003,5.0129999999999999,6.0179999999999998,7.0229999999999997,8.0289999999999999,9.0350000000000001,10.042]
["58/6",0,1.0009999999999999,2.0030000000000001,3.0059999999999998,4.0090000000000003,5.0129999999999999,6.0170000000000003,7.0220000000000002,8.0280000000000005,9.0350000000000001,10.042]
["58/7",0,1.0009999999999999,2.0030000000000001,3.0059999999999998,4.0090000000000003,5.0129999999999999,6.0170000000000003,7.0220000000000002,8.0280000000000005,9.0340000000000007,10.041]
["58/8",0,1.0009999999999999,2.0030000000000001,3.0049999999999999,4.0090000000000003,5.0119999999999996,6.0170000000000003,7.0220000000000002,8.0269999999999992,9.0340000000000007,10.041]
["58/9",0,1.0009999999999999,2.0030000000000001,3.0049999999999999,4.008,5.0119999999999996,6.016,7.0209999999999999,8.0269999999999992,9.0329999999999995,10.039999999999999]
["58/10",0,1.0009999999999999,2.0030000000000001,3.0049999999999999,4.008,5.0119999999999996,6.016,7.0209999999999999,8.0269999999999992,9.0329999999999995,10.039999999999999]
["58/11",0,1.0009999999999999,2.0030000000000001,3.0049999999999999,4.008,5.0110000000000001,6.016,7.0209999999999999,8.0259999999999998,9.032,10.039]
["59/0",0,1.0009999999999999,2.0030000000000001,3.0049999999999999,4.008,5.0110000000000001,6.0149999999999997,7.02,8.0259999999999998,9.032,10.039]
["59/1",0,1.0009999999999999,2.0019999999999998,3.0049999999999999,4.0069999999999997,5.0110000000000001,6.0149999999999997,7.02,8.0250000000000004,9.0310000000000006,10.038]
["59/2",0,1.0009999999999999,2.0019999999999998,3.004,4.0069999999999997,5.0110000000000001,6.0149999999999997,7.0190000000000001,8.0250000000000004,9.0310000000000006,10.037000000000001]
["59/3",0,1.0009999999999999,2.0019999999999998,3.004,4.0069999999999997,5.01,6.0140000000000002,7.0190000000000001,8.0239999999999991,9.0299999999999994,10.037000000000001]
["59/4",0,1.0009999999999999,2.0019999999999998,3.004,4.0069999999999997,5.01,6.0140000000000002,7.0190000000000001,8.0239999999999991,9.0299999999999994,10.036]
["59/5",0,1.0009999999999999,2.0019999999999998,3.004,4.0069999999999997,5.01,6.0140000000000002,7.0179999999999998,8.0239999999999991,9.0289999999999999,10.036]
["59/6",0,1.0009999999999999,2.0019999999999998,3.004,4.0060000000000002,5.01,6.0129999999999999,7.0179999999999998,8.0229999999999997,9.0289999999999999,10.035]
["59/7",0,1.0009999999999999,2.0019999999999998,3.004,4.0060000000000002,5.0090000000000003,6.0129999999999999,7.0179999999999998,8.0229999999999997,9.0280000000000005,10.035]
["59/8",0,1.0009999999999999,2.0019999999999998,3.004,4.0060000000000002,5.0090000000000003,6.0129999999999999,7.0170000000000003,8.0220000000000002,9.0280000000000005,10.034000000000001]
["59/9",0,1,2.0019999999999998,3.0030000000000001,4.0060000000000002,5.0090000000000003,6.0129999999999999,7.0170000000000003,8.0220000000000002,9.0269999999999992,10.034000000000001]
["59/10",0,1,2.0009999999999999,3.0030000000000001,4.0060000000000002,5.0090000000000003,6.0119999999999996,7.016,8.0210000000000008,9.0269999999999992,10.032999999999999]
["59/11",0,1,2.0009999999999999,3.0030000000000001,4.0049999999999999,5.008,6.0119999999999996,7.016,8.0210000000000008,9.0259999999999998,10.032999999999999]

{"sheet":"x-805","index":128,"n_rows":31,"n_cols":2,"rows_kept":31,"cut":false,"hidden":false,"merged":[]}
["Government Actuary's Department"]
[{"$f":"IF(title=\"> Enter workbook title here\",\"Enter workbook title in Cover sheet\",title)","v":"TPS (England & Wales) - Consolidated Factor Spreadsheet"}]
["Pension mis-selling factors - x-805"]
[]
[]
[]
["Data Item","Factor Table Information"]
["Client","TPS_EW"]
["Section","All"]
["Factor Type","Pension mis-selling"]
["Description","Pension mis-selling factors"]
["Gender","Unisex"]
["Factor Age/Period Definition","Period of time"]
["Section Number",0]
["Series Number",805]
["Table Reference","x-805"]
["Table Reference in Guidance","Pension mis-selling"]
["Associated Guidance Note","Teachers' Pension Scheme: Final salary section and career average section\nNon-Club incoming transfers: Factors and guidance\nDate: 27 October 2019"]
["Date Factors Issued to Client","2023-10-17"]
["Date Factors Implemented (if known)"]
["Factor Status","Issued"]
[]
[null,{"$f":"HYPERLINK(\"#'Factor List'!A1\",\"Back to Factor List\")","v":"Back to Factor List"}]
[]
[]
["Period","Interest Rate"]
["Up to 1 November 2015","1.1% per month"]
["1 November 2015 to 15 March 2016","5.06% per year"]
["16 March 2016 to 31 March 2019","4.856% per year"]
["1 April 2019 to 29 March 2023","4.448% per year"]
["30 March 2023 onwards","3.734% per year"]